<?xml version="1.0" encoding="UTF-8"?>
<svg width="235.49339" height="199.0731" xmlns="http://www.w3.org/2000/svg">
 <title>eraser</title>
 <metadata id="metadata4152">image/svg+xml</metadata>
 <g>
  <title>Layer 1</title>
  <g externalResourcesRequired="false" id="layer1">
   <g externalResourcesRequired="false" id="g4136">
    <path id="path9251" d="m35.981602,60.39875l121.382168,-58.35242l74.531052,28.724491l-107.369598,84.507256l-88.543621,-54.879326z" stroke-miterlimit="4" stroke-linecap="round" stroke-width="4.092603" stroke="#000000" fill="#ffffff"/>
    <path id="path9253" d="m33.87471,63.403881l-0.764889,74.212452l89.012646,49.298233l1.515221,-72.911819l-89.762978,-50.598866z" stroke-miterlimit="4" stroke-linecap="round" stroke-width="4.092603" stroke="#000000" fill="#ffffff"/>
    <path id="path9255" d="m125.597343,185.662109l106.700462,-89.6231l1.149292,-62.017879l-109.800156,83.195248c-0.401993,22.651054 1.04808,43.858589 1.950401,68.445732z" stroke-miterlimit="4" stroke-linecap="round" stroke-width="4.092603" stroke="#000000" fill="#ffffff"/>
    <path id="path9257" d="m115.694458,176.335526l-26.907951,19.424118c-6.513618,1.63855 -14.542503,1.950378 -21.056145,-0.273605l-56.585312,-29.77626c-7.95544,-2.62738 -7.79604,-6.786301 -8.69914,-13.312439l-0.44409,-47.876266c2.36204,-8.724129 9.08047,-13.134285 15.988019,-16.204353l21.761469,-11.04834l75.05492,42.352112l0.888229,56.715034z" stroke-miterlimit="4" stroke-linecap="round" stroke-width="4.003575" stroke="#000000" fill="#ffffff"/>
    <path id="path9265" d="m65.809486,48.079411l87.14286,46.428532l57.857147,-44.285702l-79.285721,-35.7143l-65.714287,33.57147z" stroke-miterlimit="4" stroke-linecap="round" stroke-width="5" stroke="#000000" fill="#bfbfbf"/>
    <path id="path9269" d="m152.207962,96.248299l0,66.861214l55.772247,-45.270645l2.145081,-64.075306" stroke-miterlimit="4" stroke-linecap="round" stroke-width="4.939821" stroke="#000000" fill="#bfbfbf"/>
    <path id="path10548" d="m73.060463,192.552856l0.000008,-57.57872l6.565979,1.010193l-1.515228,56.568527l-5.050758,0z" stroke-miterlimit="4" stroke-linecap="round" stroke-width="5" fill="#f2f2f2"/>
    <path id="path10553" d="m74.967209,139.467163l-69.614379,-33.149895l8.17416,-9.232239l65.965869,34.782646l-4.52565,7.599487z" stroke-miterlimit="4" stroke-linecap="round" stroke-width="5" fill="#f2f2f2"/>
    <path id="path10555" d="m111.232384,121.085701l-31.536476,19.200005l-1.888428,-7.416138l31.546677,-14.12133l1.878227,2.337463z" stroke-miterlimit="4" stroke-linecap="round" stroke-width="5" fill="#f2f2f2"/>
   </g>
  </g>
 </g>
</svg>