<?xml version="1.0" encoding="UTF-8" standalone="no"?>
<!-- Uploaded to: SVG Repo, www.svgrepo.com, Generator: SVG Repo Mixer Tools -->

<svg
   xmlns:dc="http://purl.org/dc/elements/1.1/"
   xmlns:cc="http://creativecommons.org/ns#"
   xmlns:rdf="http://www.w3.org/1999/02/22-rdf-syntax-ns#"
   xmlns:svg="http://www.w3.org/2000/svg"
   xmlns="http://www.w3.org/2000/svg"
   xmlns:sodipodi="http://sodipodi.sourceforge.net/DTD/sodipodi-0.dtd"
   xmlns:inkscape="http://www.inkscape.org/namespaces/inkscape"
   fill="#000000"
   width="800px"
   height="800px"
   viewBox="-0.13 0 511.967 511.967"
   version="1.1"
   id="svg4"
   sodipodi:docname="sound_on.svg"
   inkscape:version="0.92.5 (2060ec1f9f, 2020-04-08)">
  <metadata
     id="metadata10">
    <rdf:RDF>
      <cc:Work
         rdf:about="">
        <dc:format>image/svg+xml</dc:format>
        <dc:type
           rdf:resource="http://purl.org/dc/dcmitype/StillImage" />
      </cc:Work>
    </rdf:RDF>
  </metadata>
  <defs
     id="defs8" />
  <sodipodi:namedview
     pagecolor="#ffffff"
     bordercolor="#666666"
     borderopacity="1"
     objecttolerance="10"
     gridtolerance="10"
     guidetolerance="10"
     inkscape:pageopacity="0"
     inkscape:pageshadow="2"
     inkscape:window-width="1398"
     inkscape:window-height="851"
     id="namedview6"
     showgrid="false"
     inkscape:zoom="0.417193"
     inkscape:cx="365.07961"
     inkscape:cy="398.01428"
     inkscape:window-x="42"
     inkscape:window-y="25"
     inkscape:window-maximized="1"
     inkscape:current-layer="svg4" />
  <g
     id="_28_Sound"
     data-name="28 Sound"
     transform="translate(-0.144 -0.016)">
    <path
       id="Path_37"
       data-name="Path 37"
       d="M408.208,150.644a33.22,33.22,0,0,1-46.98-46.981L455.159,9.732a33.22,33.22,0,1,1,46.981,46.98ZM255.871,511.727,128.008,383.863H32.11A31.948,31.948,0,0,1,.144,351.9V160.1A31.948,31.948,0,0,1,32.11,128.136h95.9L255.871.272s31.966-4,31.966,31.966V479.76C287.837,515.722,255.871,511.727,255.871,511.727ZM223.9,128.136l-63.932,63.932h-95.9V319.931h95.9L223.9,383.864ZM383.734,287.965a31.966,31.966,0,1,1,0-63.932h95.9a31.966,31.966,0,0,1,0,63.932Zm24.474,73.39,93.932,93.931a33.221,33.221,0,0,1-46.981,46.981l-93.931-93.931a33.22,33.22,0,0,1,46.98-46.981Z"
       fill-rule="evenodd" />
  </g>
  <path
     style="opacity:1;vector-effect:none;fill:#ffffff;fill-opacity:1;stroke:none;stroke-width:22.37677193;stroke-linecap:butt;stroke-linejoin:miter;stroke-miterlimit:4;stroke-dasharray:none;stroke-dashoffset:0;stroke-opacity:1"
     d="m 298.62262,252.16091 c -16.09841,16.08437 -32.19683,32.16874 -48.29524,48.25311 -49.96906,0.61009 -100.94219,-1.20389 -150.29296,0.89887 0.59956,65.69262 -1.198923,132.37854 0.89886,197.45058 49.73093,0 99.46186,0 149.19279,0 32.16761,31.89317 63.94,64.19942 96.52495,95.66354 4.11426,-11.57397 0.4646,-28.0162 1.82925,-41.24942 0.37965,-116.29956 0.19425,-232.59997 0.24,-348.89994 -17.18811,12.14364 -33.53228,32.75699 -50.09765,47.88326 z"
     id="path817"
     inkscape:connector-curvature="0"
     transform="matrix(0.63995875,0,0,0.63995875,-0.13,0)" />
</svg>
