<?xml version="1.0" encoding="UTF-8" standalone="no"?>
<!DOCTYPE svg PUBLIC "-//W3C//DTD SVG 1.1//EN" "http://www.w3.org/Graphics/SVG/1.1/DTD/svg11.dtd">
<svg xmlns="http://www.w3.org/2000/svg" version="1.1" viewBox="0.00 0.00 400.00 400.00">
<g stroke-width="5.00" fill="none" stroke-linecap="butt">
<path stroke="#501a11" vector-effect="non-scaling-stroke" d="
  M 396.35 400.00
  Q 391.82 390.75 385.56 382.68
  Q 379.16 374.42 373.41 367.68
  Q 369.53 363.14 355.87 348.70
  C 352.14 344.76 347.94 340.92 343.34 337.69
  C 339.99 335.33 332.90 329.78 334.81 325.02
  Q 334.97 324.63 335.39 324.71
  Q 338.39 325.35 341.65 325.30
  Q 344.28 325.27 342.36 323.47
  Q 339.46 320.77 336.86 318.17
  Q 334.81 316.11 327.77 306.31
  Q 325.59 303.27 324.17 299.32
  Q 321.96 293.15 318.99 287.42
  Q 318.61 286.70 318.01 287.24
  Q 316.90 288.23 316.20 289.50
  Q 311.85 297.39 307.08 306.74
  A 0.42 0.42 0.0 0 1 306.35 306.77
  Q 306.08 306.35 306.15 305.84
  C 306.69 301.96 308.67 299.29 309.45 295.69
  C 310.88 289.10 313.94 284.12 316.57 278.37
  C 319.08 272.89 322.06 267.81 324.80 262.49
  Q 326.76 258.69 329.33 254.55
  C 332.96 248.71 336.48 243.14 340.64 237.69
  Q 345.89 230.80 351.36 223.68
  C 353.40 221.01 354.75 217.73 354.81 214.44
  Q 355.03 201.70 352.54 189.27
  Q 351.57 184.41 348.41 175.20
  Q 346.00 168.18 344.11 161.14"
/>
<path stroke="#57271a" vector-effect="non-scaling-stroke" d="
  M 344.11 161.14
  Q 342.36 155.45 338.27 152.23
  Q 334.69 149.40 334.62 149.34
  C 330.71 145.84 326.27 143.05 322.72 139.40
  Q 318.59 135.15 314.30 130.21
  C 312.84 128.52 312.88 126.24 311.15 124.55
  Q 309.14 122.58 307.56 120.44
  Q 306.87 119.50 307.12 120.64
  Q 308.11 125.05 307.70 129.52
  A 0.85 0.85 0.0 0 1 307.25 130.18
  C 306.22 130.71 305.01 130.29 304.51 129.25
  Q 303.16 126.41 300.35 125.55
  C 295.58 124.10 294.61 119.95 292.08 116.39
  C 290.09 113.60 291.30 109.21 292.82 106.60
  C 293.20 105.96 293.89 105.70 294.56 105.47"
/>
<path stroke="#501a11" vector-effect="non-scaling-stroke" d="
  M 294.56 105.47
  Q 297.01 105.02 299.00 103.74
  A 0.69 0.69 0.0 0 0 299.18 102.75
  C 295.29 97.50 290.69 94.50 285.18 91.43
  C 278.66 87.79 271.67 85.06 264.79 81.88
  C 254.84 77.29 244.64 74.27 234.45 73.74
  Q 226.93 73.35 219.45 72.98
  Q 212.90 72.66 204.45 71.85
  Q 197.47 71.17 190.43 70.61
  Q 189.11 70.50 183.78 70.71
  Q 174.97 71.04 168.88 64.41"
/>
<path stroke="#80725f" vector-effect="non-scaling-stroke" d="
  M 297.82 107.50
  L 302.14 113.77
  A 0.12 0.12 0.0 0 0 302.31 113.80
  L 302.35 113.77
  A 3.78 3.23 55.4 0 0 302.86 108.83
  L 302.69 108.58
  A 3.78 3.23 55.4 0 0 297.89 107.30
  L 297.85 107.33
  A 0.12 0.12 0.0 0 0 297.82 107.50"
/>
<path stroke="#501a11" vector-effect="non-scaling-stroke" d="
  M 166.26 65.26
  Q 165.51 66.02 165.19 67.04
  Q 165.05 67.50 165.23 67.95
  C 167.02 72.39 171.22 73.62 172.77 78.12
  Q 172.99 78.73 173.61 78.93
  Q 174.16 79.11 174.68 79.39
  Q 175.42 79.80 174.58 79.92
  C 171.82 80.32 169.50 81.67 166.81 82.41
  Q 155.89 85.41 145.71 87.84
  C 142.09 88.70 138.58 90.03 134.98 91.01
  Q 130.81 92.15 127.22 94.08
  Q 117.77 99.16 112.71 103.72
  C 110.85 105.40 108.64 109.20 105.86 111.21
  C 103.64 112.82 101.61 114.36 100.68 117.07
  Q 99.35 120.98 97.88 125.08
  A 0.82 0.82 0.0 0 1 97.18 125.63
  C 95.71 125.79 94.15 125.26 92.68 125.28
  Q 86.59 125.38 81.29 125.59
  Q 76.18 125.80 81.07 127.24
  Q 82.50 127.66 83.98 128.50
  C 85.24 129.21 86.64 129.27 88.06 129.36
  A 0.67 0.67 0.0 0 1 88.66 130.21
  L 87.60 133.97
  Q 87.53 134.22 87.78 134.27
  L 88.09 134.32
  Q 88.50 134.40 88.54 133.98
  Q 88.68 132.70 90.03 132.75
  Q 90.94 132.78 90.73 133.66
  Q 90.52 134.54 89.94 135.26
  Q 89.59 135.67 89.73 136.19
  Q 91.49 142.84 97.45 144.43
  Q 97.96 144.56 98.00 145.09
  Q 98.17 147.27 96.04 148.12
  Q 91.99 149.74 88.02 151.11
  A 2.08 2.08 0.0 0 0 87.03 154.32
  Q 89.20 157.24 91.77 160.07
  Q 95.14 163.78 91.00 166.47
  Q 90.02 167.11 88.96 167.39
  Q 88.33 167.56 88.78 168.02
  L 89.02 168.27
  Q 89.33 168.60 89.36 169.05
  C 89.70 173.44 90.12 179.04 88.63 183.18
  Q 87.95 185.06 88.30 187.32
  A 2.30 2.30 0.0 0 1 86.97 189.77
  Q 80.34 192.76 73.14 193.39
  C 71.69 193.51 70.46 193.06 69.07 192.82
  A 1.31 1.30 34.5 0 0 68.19 192.98
  C 65.09 194.80 63.14 197.32 59.74 198.83
  Q 54.61 201.12 49.24 204.21
  C 47.81 205.03 46.51 205.20 44.97 205.59
  A 1.45 1.44 -16.1 0 0 43.95 207.43
  Q 44.21 208.26 45.03 208.66
  A 0.66 0.65 -58.3 0 0 45.85 208.46
  C 46.45 207.62 47.49 207.31 48.46 207.68
  Q 50.21 208.34 51.95 207.60
  Q 52.48 207.37 53.05 207.50
  Q 55.46 208.02 58.03 207.62
  C 63.82 206.72 65.39 212.63 61.50 215.79
  Q 59.47 217.43 57.97 219.30
  Q 57.54 219.85 56.86 220.02
  Q 54.03 220.72 54.01 224.62
  Q 54.00 225.21 54.47 225.59
  L 55.98 226.81
  Q 56.54 227.26 57.25 227.25
  L 60.85 227.20
  A 2.24 2.24 0.0 0 1 63.00 228.69
  L 64.65 233.36
  Q 64.83 233.87 64.63 234.36
  C 63.71 236.59 63.11 239.24 61.42 241.03
  Q 59.39 243.16 57.54 245.51
  A 1.25 1.25 0.0 0 0 57.63 247.15
  Q 61.93 251.58 58.60 257.21
  Q 53.42 265.98 43.73 271.73
  A 0.90 0.90 0.0 0 0 43.69 273.25
  C 46.52 275.13 53.49 279.20 50.58 283.53
  Q 46.01 290.31 42.28 297.82
  C 40.69 301.01 40.05 304.41 38.66 307.67
  C 34.25 317.96 29.90 327.14 24.04 336.67
  Q 20.15 343.00 17.24 351.30
  C 16.57 353.22 18.85 354.29 17.23 356.40
  Q 15.64 358.46 18.22 358.15
  C 19.83 357.96 21.11 357.29 22.62 358.40
  A 1.51 1.50 36.8 0 1 22.93 360.54
  C 21.27 362.66 19.51 364.28 18.19 366.71
  Q 14.00 374.38 11.30 380.35
  Q 9.86 383.55 9.02 387.77
  C 8.67 389.48 7.41 390.69 7.01 392.50
  Q 6.44 395.03 5.19 397.49
  Q 4.94 397.96 5.23 398.42
  L 6.21 400.00"
/>
<path stroke="#501a11" vector-effect="non-scaling-stroke" d="
  M 165.78 78.34
  Q 166.89 79.75 168.14 78.86
  Q 169.66 77.77 168.06 77.16"
/>
<path stroke="#501a11" vector-effect="non-scaling-stroke" d="
  M 73.9177 127.1202
  A 0.27 0.27 0.0 0 0 73.5456 127.0343
  L 64.5055 132.6832
  A 0.27 0.27 0.0 0 0 64.4196 133.0553
  L 64.8223 133.6998
  A 0.27 0.27 0.0 0 0 65.1944 133.7857
  L 74.2345 128.1368
  A 0.27 0.27 0.0 0 0 74.3204 127.7647
  L 73.9177 127.1202"
/>
<path stroke="#501a11" vector-effect="non-scaling-stroke" d="
  M 70.52 136.17
  L 70.86 137.08
  A 0.12 0.12 0.0 0 0 71.02 137.15
  L 83.41 132.52
  A 0.60 0.27 69.5 0 0 83.45 131.86
  L 83.45 131.85
  A 0.60 0.27 69.5 0 0 82.98 131.38
  L 70.59 136.01
  A 0.12 0.12 0.0 0 0 70.52 136.17"
/>
<path stroke="#501a11" vector-effect="non-scaling-stroke" d="
  M 66.31 141.13
  Q 67.23 140.72 68.07 140.05
  Q 68.51 139.70 68.48 139.17
  Q 68.45 138.52 67.83 138.72
  Q 66.46 139.15 66.18 140.53
  A 1.22 1.21 -11.1 0 1 65.65 141.31
  L 63.52 142.70
  Q 62.97 143.06 63.02 143.71
  L 63.06 144.21
  Q 63.13 145.05 63.82 144.57
  Q 65.12 143.64 65.67 141.86
  Q 65.82 141.35 66.31 141.13"
/>
<path stroke="#501a11" vector-effect="non-scaling-stroke" d="
  M 86.42 143.28
  L 86.36 142.30
  A 0.23 0.23 0.0 0 0 86.12 142.09
  L 85.95 142.10
  A 7.04 0.58 -3.5 0 0 78.96 143.11
  L 78.98 143.39
  A 7.04 0.58 -3.5 0 0 86.04 143.54
  L 86.21 143.53
  A 0.23 0.23 0.0 0 0 86.42 143.28"
/>
<path stroke="#501a11" vector-effect="non-scaling-stroke" d="
  M 70.77 165.28
  Q 70.09 164.89 69.61 164.18
  A 0.58 0.57 55.2 0 0 68.81 164.03
  Q 68.22 164.44 68.37 165.16
  C 68.91 167.86 68.99 170.86 70.64 173.21
  Q 72.90 176.44 75.88 178.81
  Q 78.23 180.68 75.23 180.69
  C 73.00 180.69 71.38 180.09 69.40 181.75
  Q 69.08 182.01 68.67 182.03
  C 64.41 182.23 60.57 177.68 59.91 174.16
  Q 59.72 173.16 58.73 172.93
  L 57.26 172.59
  Q 56.01 172.30 56.65 173.41
  Q 57.96 175.70 58.00 178.19
  A 1.27 1.25 23.3 0 0 58.36 179.07
  Q 63.02 183.92 69.29 187.48
  C 74.44 190.40 81.16 188.47 86.29 185.88
  A 1.49 1.48 -16.9 0 0 87.10 184.37
  Q 86.69 181.06 86.90 177.48
  C 87.06 174.84 86.87 171.64 84.85 169.69
  C 82.86 167.77 81.52 165.67 81.78 162.73
  Q 81.80 162.49 81.59 162.35
  L 78.61 160.42
  Q 78.45 160.32 78.41 160.51
  C 77.53 165.25 79.72 168.81 82.72 172.22
  A 1.53 1.53 0.0 0 1 81.63 174.76
  Q 80.36 174.81 79.26 173.99
  C 74.02 170.07 72.45 163.23 73.53 157.09
  Q 74.22 153.12 75.28 149.42
  C 75.71 147.92 76.60 146.62 77.40 145.30
  Q 78.36 143.70 77.04 145.02
  Q 73.56 148.54 72.04 153.42
  Q 70.74 157.56 71.50 164.80
  Q 71.60 165.75 70.77 165.28"
/>
<path stroke="#501a11" vector-effect="non-scaling-stroke" d="
  M 59.10 150.93
  Q 60.22 149.49 61.40 148.14
  Q 61.92 147.56 61.67 146.83
  Q 61.46 146.25 60.88 146.44
  L 57.82 147.46
  Q 57.29 147.63 57.21 148.18
  L 56.93 150.00
  Q 56.85 150.51 56.56 150.93
  Q 54.84 153.43 53.83 156.36
  Q 53.63 156.94 54.22 157.11
  Q 54.67 157.25 55.08 156.93
  Q 55.83 156.36 55.92 155.43
  Q 56.05 154.09 57.28 153.54
  A 1.10 1.08 -33.7 0 1 58.52 153.78
  Q 59.38 154.68 60.56 155.12
  A 0.75 0.75 0.0 0 0 61.46 154.82
  Q 62.14 153.75 62.31 152.59
  A 0.66 0.66 0.0 0 0 61.68 151.84
  L 59.48 151.74
  A 0.50 0.50 0.0 0 1 59.10 150.93"
/>
<path stroke="#501a11" vector-effect="non-scaling-stroke" d="
  M 79.84 153.10
  C 79.89 152.80 79.98 152.57 80.12 152.29
  Q 80.52 151.42 79.73 151.96
  Q 79.06 152.43 78.83 153.25
  A 0.43 0.42 -11.9 0 0 79.51 153.69
  Q 79.77 153.47 79.84 153.10"
/>
<path stroke="#501a11" vector-effect="non-scaling-stroke" d="
  M 67.5547 153.8053
  A 0.76 0.53 83.6 0 0 67.9967 152.9909
  A 0.76 0.53 83.6 0 0 67.3853 152.2947
  A 0.76 0.53 83.6 0 0 66.9433 153.1091
  A 0.76 0.53 83.6 0 0 67.5547 153.8053"
/>
<path stroke="#501a11" vector-effect="non-scaling-stroke" d="
  M 84.46 157.22
  A 0.33 0.33 0.0 0 0 83.89 157.50
  L 84.80 161.86
  A 0.33 0.33 0.0 0 0 84.93 162.05
  L 87.76 164.19
  A 0.33 0.33 0.0 0 0 88.29 163.97
  L 88.55 162.02
  A 0.33 0.33 0.0 0 0 88.47 161.76
  L 84.46 157.22"
/>
<path stroke="#501a11" vector-effect="non-scaling-stroke" d="
  M 64.87 158.84
  Q 65.10 158.25 64.48 158.37
  Q 62.59 158.74 61.09 157.80
  A 2.22 2.20 -42.9 0 0 58.90 157.73
  Q 56.90 158.78 54.59 159.08
  Q 54.06 159.14 54.06 159.68
  L 54.07 159.95
  Q 54.07 160.15 54.26 160.18
  Q 56.25 160.45 58.27 159.87
  C 60.16 159.33 62.19 159.53 64.11 159.76
  Q 64.48 159.81 64.61 159.46
  L 64.87 158.84"
/>
<path stroke="#501a11" vector-effect="non-scaling-stroke" d="
  M 61.62 162.72
  Q 63.30 164.14 63.02 166.41
  C 62.41 171.35 63.47 176.87 68.36 178.85
  Q 68.85 179.06 69.26 178.70
  Q 69.78 178.26 69.30 177.77
  C 67.08 175.53 65.27 172.99 65.22 169.68
  C 65.20 167.82 65.17 163.45 64.27 161.98
  Q 63.96 161.47 63.39 161.64
  L 61.74 162.14
  Q 61.15 162.32 61.62 162.72"
/>
<path stroke="#501a11" vector-effect="non-scaling-stroke" d="
  M 57.18 167.87
  C 55.59 167.10 56.34 165.09 58.07 165.09
  A 1.98 1.96 19.7 0 0 59.55 164.40
  L 60.91 162.81
  Q 61.49 162.13 60.65 162.44
  L 55.76 164.24
  Q 55.12 164.47 55.18 165.15
  C 55.36 167.14 56.47 171.29 59.48 170.35
  Q 61.49 169.72 59.54 168.92
  Q 58.36 168.44 57.18 167.87"
/>
<path stroke="#a7412a" vector-effect="non-scaling-stroke" d="
  M 294.56 105.47
  L 294.23 104.38
  Q 294.09 103.89 293.60 103.74
  Q 282.59 100.27 271.74 96.14
  C 268.33 94.84 264.77 94.82 261.25 94.45
  Q 256.62 93.97 252.66 93.08
  Q 240.37 90.32 229.33 88.42
  Q 221.81 87.12 210.77 87.01
  Q 204.46 86.94 199.30 87.78
  Q 193.77 88.67 187.90 89.49
  Q 179.89 90.61 174.14 94.80
  Q 165.92 100.79 158.18 106.70
  Q 140.80 119.98 128.50 136.07
  C 127.51 137.35 126.73 138.83 126.28 140.39
  Q 122.14 154.60 119.95 171.75
  Q 119.56 174.79 120.65 176.89
  C 124.56 184.42 125.06 192.09 125.02 200.25
  C 124.96 210.85 123.88 220.23 115.92 227.89
  A 2.33 2.32 -32.1 0 0 115.35 230.35
  C 118.00 237.68 121.42 244.52 123.47 251.90
  Q 127.69 267.12 136.20 279.84
  Q 137.35 281.57 136.12 283.19
  Q 132.00 288.56 126.96 284.66
  Q 125.37 283.43 124.41 281.40
  A 0.26 0.26 0.0 0 0 124.05 281.28
  L 123.82 281.41
  Q 123.42 281.64 123.66 282.03
  L 125.14 284.47
  A 2.22 2.19 -54.5 0 1 125.40 286.08
  C 124.83 288.68 123.69 291.56 124.38 294.20
  Q 124.50 294.68 125.64 297.79
  Q 131.47 313.73 142.15 326.75
  C 144.79 329.96 147.25 333.42 149.50 336.74
  C 150.16 337.72 151.12 338.45 152.10 339.11
  Q 152.75 339.55 151.98 339.73
  Q 151.77 339.78 151.58 339.70
  Q 144.78 336.79 136.90 334.95
  Q 133.27 334.11 127.89 329.98
  Q 125.63 328.25 123.61 330.24
  L 123.26 330.58
  A 1.93 1.92 43.3 0 0 123.35 333.40
  C 126.68 336.29 132.69 341.24 133.46 345.28
  A 2.00 2.00 0.0 0 1 133.26 346.59
  C 130.42 351.98 132.20 356.97 134.86 362.04
  Q 138.48 368.94 144.03 375.99
  Q 153.43 387.92 162.88 400.00"
/>
<path stroke="#a7412a" vector-effect="non-scaling-stroke" d="
  M 344.11 161.14
  Q 342.95 161.06 341.86 160.93
  C 334.67 160.07 335.07 168.33 336.28 172.76
  C 339.70 185.30 342.14 196.67 339.04 208.57
  C 337.44 214.72 336.42 220.46 333.19 226.21
  Q 329.32 233.10 323.29 242.23
  Q 312.84 258.07 297.38 267.40
  C 296.24 268.08 294.83 269.64 294.09 270.78
  Q 286.57 282.48 274.92 289.56
  Q 273.05 290.69 274.37 292.44
  C 277.40 296.43 281.20 301.07 286.00 302.88
  Q 289.62 304.24 292.89 306.21
  Q 294.29 307.06 293.47 308.47
  Q 290.52 313.58 287.41 318.31
  C 285.27 321.58 281.86 323.02 279.06 325.58
  A 1.23 1.22 -17.4 0 0 278.67 326.32
  Q 278.55 327.21 278.98 327.63
  Q 280.11 328.72 281.41 327.85
  L 285.26 325.28
  Q 285.37 325.20 285.46 325.29
  L 285.66 325.49
  A 0.35 0.34 -44.4 0 1 285.65 325.99
  Q 281.41 329.74 277.42 333.33
  Q 275.37 335.18 272.99 339.43
  Q 253.67 373.86 223.19 400.00"
/>
<path stroke="#57271a" vector-effect="non-scaling-stroke" d="
  M 185.34 100.58
  Q 179.48 99.27 174.83 101.30
  C 171.12 102.92 170.15 108.91 169.74 112.54
  Q 168.26 125.63 180.68 129.23
  Q 188.39 131.46 195.37 128.24
  Q 197.80 127.12 199.09 124.90
  A 1.15 1.10 -35.7 0 0 199.23 124.14
  Q 198.57 120.38 198.26 116.63
  Q 197.90 112.33 194.42 106.62
  Q 191.58 101.97 185.34 100.58"
/>
<path stroke="#57271a" vector-effect="non-scaling-stroke" d="
  M 247.65 196.81
  C 247.77 204.80 247.98 212.48 251.75 219.67
  A 0.84 0.84 0.0 0 0 252.83 220.05
  Q 256.74 218.31 261.59 219.37
  C 263.10 219.70 264.73 219.03 266.28 219.01
  C 276.07 218.94 285.53 218.02 295.32 219.39
  Q 297.35 219.68 298.65 218.11
  A 1.31 1.27 -33.3 0 0 298.90 216.98
  Q 297.05 209.66 299.22 200.69
  Q 299.69 198.71 300.78 197.04
  A 2.33 2.33 0.0 0 1 303.01 195.99
  C 312.13 197.08 320.33 195.93 328.01 191.11
  Q 332.12 188.53 331.11 183.85
  A 0.42 0.41 -31.6 0 0 330.38 183.68
  Q 325.66 189.55 316.72 191.17
  Q 307.25 192.90 300.09 191.09
  C 295.17 189.85 290.54 189.19 286.67 185.35
  Q 284.61 183.30 282.67 179.90
  Q 281.01 176.98 280.93 173.99
  Q 280.74 167.36 281.35 161.45
  A 2.70 2.68 -19.8 0 1 282.11 159.85
  Q 285.53 156.36 288.31 152.09
  C 292.05 146.32 297.39 141.63 302.12 136.47
  A 1.57 1.56 -41.1 0 0 302.26 134.53
  Q 298.42 128.99 293.94 123.24
  C 289.74 117.83 284.33 121.49 279.14 120.14
  Q 276.71 119.51 274.08 119.46
  Q 260.56 119.24 251.49 120.19
  C 248.63 120.48 242.58 122.22 241.83 125.62
  Q 240.84 130.08 241.87 136.38
  Q 241.98 137.07 241.28 137.01
  Q 240.45 136.94 239.56 137.02
  Q 237.46 137.20 239.20 138.40
  C 245.99 143.05 253.47 146.54 260.60 150.95
  C 266.17 154.39 275.09 160.41 273.98 168.08
  Q 273.45 171.72 273.08 175.35
  C 271.90 187.01 246.52 192.69 237.43 194.48
  C 233.37 195.27 229.09 195.28 224.95 195.50
  Q 216.99 195.92 204.15 188.92
  A 1.49 1.47 -33.2 0 0 203.27 188.74
  Q 202.08 188.87 202.16 189.63
  Q 202.35 191.50 203.82 192.52
  Q 213.08 198.98 223.49 199.37
  C 231.16 199.66 239.26 198.34 246.67 196.09
  A 0.76 0.76 0.0 0 1 247.65 196.81"
/>
<path stroke="#80725f" vector-effect="non-scaling-stroke" d="
  M 192.66 113.50
  C 193.73 109.80 191.61 105.75 188.71 103.54
  A 3.95 3.94 -45.5 0 0 183.86 103.58
  Q 183.75 103.67 183.65 103.76
  Q 182.02 105.19 183.48 106.78
  Q 186.91 110.54 190.93 114.02
  A 1.07 1.07 0.0 0 0 192.66 113.50"
/>
<path stroke="#80725f" vector-effect="non-scaling-stroke" d="
  M 271.70 188.21
  C 266.27 192.07 260.98 194.89 254.22 195.62
  A 1.47 1.46 -4.4 0 0 252.91 197.14
  Q 253.25 204.70 254.62 212.75
  A 1.95 1.93 -7.5 0 0 256.72 214.35
  L 271.75 212.87
  A 1.55 1.55 0.0 0 0 273.15 211.27
  L 272.25 188.48
  Q 272.22 187.84 271.70 188.21"
/>
<path stroke="#80725f" vector-effect="non-scaling-stroke" d="
  M 294.62 195.30
  A 0.90 0.90 0.0 0 0 294.05 194.41
  L 280.47 189.18
  A 0.90 0.90 0.0 0 0 279.24 190.02
  L 279.43 212.51
  A 0.90 0.90 0.0 0 0 280.21 213.39
  L 292.54 215.16
  A 0.90 0.90 0.0 0 0 293.56 214.32
  L 294.62 195.30"
/>
</g>
<path fill="#ad4d33" d="
  M 294.56 105.47
  C 293.89 105.70 293.20 105.96 292.82 106.60
  C 291.30 109.21 290.09 113.60 292.08 116.39
  C 294.61 119.95 295.58 124.10 300.35 125.55
  Q 303.16 126.41 304.51 129.25
  C 305.01 130.29 306.22 130.71 307.25 130.18
  A 0.85 0.85 0.0 0 0 307.70 129.52
  Q 308.11 125.05 307.12 120.64
  Q 306.87 119.50 307.56 120.44
  Q 309.14 122.58 311.15 124.55
  C 312.88 126.24 312.84 128.52 314.30 130.21
  Q 318.59 135.15 322.72 139.40
  C 326.27 143.05 330.71 145.84 334.62 149.34
  Q 334.69 149.40 338.27 152.23
  Q 342.36 155.45 344.11 161.14
  Q 342.95 161.06 341.86 160.93
  C 334.67 160.07 335.07 168.33 336.28 172.76
  C 339.70 185.30 342.14 196.67 339.04 208.57
  C 337.44 214.72 336.42 220.46 333.19 226.21
  Q 329.32 233.10 323.29 242.23
  Q 312.84 258.07 297.38 267.40
  C 296.24 268.08 294.83 269.64 294.09 270.78
  Q 286.57 282.48 274.92 289.56
  Q 273.05 290.69 274.37 292.44
  C 277.40 296.43 281.20 301.07 286.00 302.88
  Q 289.62 304.24 292.89 306.21
  Q 294.29 307.06 293.47 308.47
  Q 290.52 313.58 287.41 318.31
  C 285.27 321.58 281.86 323.02 279.06 325.58
  A 1.23 1.22 -17.4 0 0 278.67 326.32
  Q 278.55 327.21 278.98 327.63
  Q 280.11 328.72 281.41 327.85
  L 285.26 325.28
  Q 285.37 325.20 285.46 325.29
  L 285.66 325.49
  A 0.35 0.34 -44.4 0 1 285.65 325.99
  Q 281.41 329.74 277.42 333.33
  Q 275.37 335.18 272.99 339.43
  Q 253.67 373.86 223.19 400.00
  L 162.88 400.00
  Q 153.43 387.92 144.03 375.99
  Q 138.48 368.94 134.86 362.04
  C 132.20 356.97 130.42 351.98 133.26 346.59
  A 2.00 2.00 0.0 0 0 133.46 345.28
  C 132.69 341.24 126.68 336.29 123.35 333.40
  A 1.93 1.92 43.3 0 1 123.26 330.58
  L 123.61 330.24
  Q 125.63 328.25 127.89 329.98
  Q 133.27 334.11 136.90 334.95
  Q 144.78 336.79 151.58 339.70
  Q 151.77 339.78 151.98 339.73
  Q 152.75 339.55 152.10 339.11
  C 151.12 338.45 150.16 337.72 149.50 336.74
  C 147.25 333.42 144.79 329.96 142.15 326.75
  Q 131.47 313.73 125.64 297.79
  Q 124.50 294.68 124.38 294.20
  C 123.69 291.56 124.83 288.68 125.40 286.08
  A 2.22 2.19 -54.5 0 0 125.14 284.47
  L 123.66 282.03
  Q 123.42 281.64 123.82 281.41
  L 124.05 281.28
  A 0.26 0.26 0.0 0 1 124.41 281.40
  Q 125.37 283.43 126.96 284.66
  Q 132.00 288.56 136.12 283.19
  Q 137.35 281.57 136.20 279.84
  Q 127.69 267.12 123.47 251.90
  C 121.42 244.52 118.00 237.68 115.35 230.35
  A 2.33 2.32 -32.1 0 1 115.92 227.89
  C 123.88 220.23 124.96 210.85 125.02 200.25
  C 125.06 192.09 124.56 184.42 120.65 176.89
  Q 119.56 174.79 119.95 171.75
  Q 122.14 154.60 126.28 140.39
  C 126.73 138.83 127.51 137.35 128.50 136.07
  Q 140.80 119.98 158.18 106.70
  Q 165.92 100.79 174.14 94.80
  Q 179.89 90.61 187.90 89.49
  Q 193.77 88.67 199.30 87.78
  Q 204.46 86.94 210.77 87.01
  Q 221.81 87.12 229.33 88.42
  Q 240.37 90.32 252.66 93.08
  Q 256.62 93.97 261.25 94.45
  C 264.77 94.82 268.33 94.84 271.74 96.14
  Q 282.59 100.27 293.60 103.74
  Q 294.09 103.89 294.23 104.38
  L 294.56 105.47
  Z
  M 185.34 100.58
  Q 179.48 99.27 174.83 101.30
  C 171.12 102.92 170.15 108.91 169.74 112.54
  Q 168.26 125.63 180.68 129.23
  Q 188.39 131.46 195.37 128.24
  Q 197.80 127.12 199.09 124.90
  A 1.15 1.10 -35.7 0 0 199.23 124.14
  Q 198.57 120.38 198.26 116.63
  Q 197.90 112.33 194.42 106.62
  Q 191.58 101.97 185.34 100.58
  Z
  M 247.65 196.81
  C 247.77 204.80 247.98 212.48 251.75 219.67
  A 0.84 0.84 0.0 0 0 252.83 220.05
  Q 256.74 218.31 261.59 219.37
  C 263.10 219.70 264.73 219.03 266.28 219.01
  C 276.07 218.94 285.53 218.02 295.32 219.39
  Q 297.35 219.68 298.65 218.11
  A 1.31 1.27 -33.3 0 0 298.90 216.98
  Q 297.05 209.66 299.22 200.69
  Q 299.69 198.71 300.78 197.04
  A 2.33 2.33 0.0 0 1 303.01 195.99
  C 312.13 197.08 320.33 195.93 328.01 191.11
  Q 332.12 188.53 331.11 183.85
  A 0.42 0.41 -31.6 0 0 330.38 183.68
  Q 325.66 189.55 316.72 191.17
  Q 307.25 192.90 300.09 191.09
  C 295.17 189.85 290.54 189.19 286.67 185.35
  Q 284.61 183.30 282.67 179.90
  Q 281.01 176.98 280.93 173.99
  Q 280.74 167.36 281.35 161.45
  A 2.70 2.68 -19.8 0 1 282.11 159.85
  Q 285.53 156.36 288.31 152.09
  C 292.05 146.32 297.39 141.63 302.12 136.47
  A 1.57 1.56 -41.1 0 0 302.26 134.53
  Q 298.42 128.99 293.94 123.24
  C 289.74 117.83 284.33 121.49 279.14 120.14
  Q 276.71 119.51 274.08 119.46
  Q 260.56 119.24 251.49 120.19
  C 248.63 120.48 242.58 122.22 241.83 125.62
  Q 240.84 130.08 241.87 136.38
  Q 241.98 137.07 241.28 137.01
  Q 240.45 136.94 239.56 137.02
  Q 237.46 137.20 239.20 138.40
  C 245.99 143.05 253.47 146.54 260.60 150.95
  C 266.17 154.39 275.09 160.41 273.98 168.08
  Q 273.45 171.72 273.08 175.35
  C 271.90 187.01 246.52 192.69 237.43 194.48
  C 233.37 195.27 229.09 195.28 224.95 195.50
  Q 216.99 195.92 204.15 188.92
  A 1.49 1.47 -33.2 0 0 203.27 188.74
  Q 202.08 188.87 202.16 189.63
  Q 202.35 191.50 203.82 192.52
  Q 213.08 198.98 223.49 199.37
  C 231.16 199.66 239.26 198.34 246.67 196.09
  A 0.76 0.76 0.0 0 1 247.65 196.81
  Z"
/>
<g fill="#000000">
<path d="
  M 399.21 400.00
  L 396.35 400.00
  Q 391.82 390.75 385.56 382.68
  Q 379.16 374.42 373.41 367.68
  Q 369.53 363.14 355.87 348.70
  C 352.14 344.76 347.94 340.92 343.34 337.69
  C 339.99 335.33 332.90 329.78 334.81 325.02
  Q 334.97 324.63 335.39 324.71
  Q 338.39 325.35 341.65 325.30
  Q 344.28 325.27 342.36 323.47
  Q 339.46 320.77 336.86 318.17
  Q 334.81 316.11 327.77 306.31
  Q 325.59 303.27 324.17 299.32
  Q 321.96 293.15 318.99 287.42
  Q 318.61 286.70 318.01 287.24
  Q 316.90 288.23 316.20 289.50
  Q 311.85 297.39 307.08 306.74
  A 0.42 0.42 0.0 0 1 306.35 306.77
  Q 306.08 306.35 306.15 305.84
  C 306.69 301.96 308.67 299.29 309.45 295.69
  C 310.88 289.10 313.94 284.12 316.57 278.37
  C 319.08 272.89 322.06 267.81 324.80 262.49
  Q 326.76 258.69 329.33 254.55
  C 332.96 248.71 336.48 243.14 340.64 237.69
  Q 345.89 230.80 351.36 223.68
  C 353.40 221.01 354.75 217.73 354.81 214.44
  Q 355.03 201.70 352.54 189.27
  Q 351.57 184.41 348.41 175.20
  Q 346.00 168.18 344.11 161.14
  Q 342.36 155.45 338.27 152.23
  Q 334.69 149.40 334.62 149.34
  C 330.71 145.84 326.27 143.05 322.72 139.40
  Q 318.59 135.15 314.30 130.21
  C 312.84 128.52 312.88 126.24 311.15 124.55
  Q 309.14 122.58 307.56 120.44
  Q 306.87 119.50 307.12 120.64
  Q 308.11 125.05 307.70 129.52
  A 0.85 0.85 0.0 0 1 307.25 130.18
  C 306.22 130.71 305.01 130.29 304.51 129.25
  Q 303.16 126.41 300.35 125.55
  C 295.58 124.10 294.61 119.95 292.08 116.39
  C 290.09 113.60 291.30 109.21 292.82 106.60
  C 293.20 105.96 293.89 105.70 294.56 105.47
  Q 297.01 105.02 299.00 103.74
  A 0.69 0.69 0.0 0 0 299.18 102.75
  C 295.29 97.50 290.69 94.50 285.18 91.43
  C 278.66 87.79 271.67 85.06 264.79 81.88
  C 254.84 77.29 244.64 74.27 234.45 73.74
  Q 226.93 73.35 219.45 72.98
  Q 212.90 72.66 204.45 71.85
  Q 197.47 71.17 190.43 70.61
  Q 189.11 70.50 183.78 70.71
  Q 174.97 71.04 168.88 64.41
  Q 169.51 61.96 171.70 62.87
  Q 177.04 65.09 179.90 67.54
  Q 182.03 69.37 184.30 67.72
  Q 184.63 67.48 184.79 67.10
  Q 185.62 65.07 183.83 63.82
  L 178.59 60.15
  A 1.71 1.69 19.4 0 1 177.86 58.65
  Q 177.90 57.91 178.27 57.37
  A 1.05 1.05 0.0 0 1 179.78 57.15
  C 184.80 61.08 190.13 65.01 196.50 65.48
  Q 201.96 65.88 207.47 65.89
  Q 216.82 65.90 228.26 66.80
  C 235.41 67.36 242.01 68.88 248.84 71.49
  C 265.66 77.91 281.56 83.84 296.11 92.91
  C 299.70 95.16 302.88 98.24 305.49 101.70
  Q 310.92 108.89 313.54 114.57
  Q 316.60 121.18 319.80 127.21
  C 321.49 130.40 325.18 133.48 327.61 136.58
  Q 331.68 141.77 337.46 147.86
  Q 338.45 148.91 339.85 149.47
  Q 344.69 151.42 347.81 156.86
  C 350.41 161.40 351.26 166.74 353.54 171.54
  C 357.27 179.37 357.89 189.55 357.90 198.28
  Q 357.91 206.81 357.93 214.64
  Q 357.93 216.13 357.55 218.01
  Q 357.46 218.48 357.70 218.90
  Q 358.65 220.52 357.47 222.25
  Q 353.25 228.43 349.28 234.76
  Q 336.50 255.12 324.99 274.75
  Q 321.33 281.01 323.62 287.31
  Q 331.61 309.20 348.34 323.15
  Q 350.36 324.84 352.97 325.76
  C 354.71 326.38 356.25 327.77 356.07 329.73
  A 2.20 2.19 -86.1 0 1 353.80 331.72
  L 346.85 331.43
  A 1.46 1.46 0.0 0 0 345.73 333.90
  C 348.99 337.30 352.92 340.09 356.36 343.30
  Q 366.49 352.76 378.72 366.52
  Q 389.57 378.75 396.41 391.90
  Q 396.68 392.43 398.52 394.74
  Q 400.27 396.94 399.21 400.00
  Z
  M 297.82 107.50
  L 302.14 113.77
  A 0.12 0.12 0.0 0 0 302.31 113.80
  L 302.35 113.77
  A 3.78 3.23 55.4 0 0 302.86 108.83
  L 302.69 108.58
  A 3.78 3.23 55.4 0 0 297.89 107.30
  L 297.85 107.33
  A 0.12 0.12 0.0 0 0 297.82 107.50
  Z"
/>
<path d="
  M 166.26 65.26
  Q 165.51 66.02 165.19 67.04
  Q 165.05 67.50 165.23 67.95
  C 167.02 72.39 171.22 73.62 172.77 78.12
  Q 172.99 78.73 173.61 78.93
  Q 174.16 79.11 174.68 79.39
  Q 175.42 79.80 174.58 79.92
  C 171.82 80.32 169.50 81.67 166.81 82.41
  Q 155.89 85.41 145.71 87.84
  C 142.09 88.70 138.58 90.03 134.98 91.01
  Q 130.81 92.15 127.22 94.08
  Q 117.77 99.16 112.71 103.72
  C 110.85 105.40 108.64 109.20 105.86 111.21
  C 103.64 112.82 101.61 114.36 100.68 117.07
  Q 99.35 120.98 97.88 125.08
  A 0.82 0.82 0.0 0 1 97.18 125.63
  C 95.71 125.79 94.15 125.26 92.68 125.28
  Q 86.59 125.38 81.29 125.59
  Q 76.18 125.80 81.07 127.24
  Q 82.50 127.66 83.98 128.50
  C 85.24 129.21 86.64 129.27 88.06 129.36
  A 0.67 0.67 0.0 0 1 88.66 130.21
  L 87.60 133.97
  Q 87.53 134.22 87.78 134.27
  L 88.09 134.32
  Q 88.50 134.40 88.54 133.98
  Q 88.68 132.70 90.03 132.75
  Q 90.94 132.78 90.73 133.66
  Q 90.52 134.54 89.94 135.26
  Q 89.59 135.67 89.73 136.19
  Q 91.49 142.84 97.45 144.43
  Q 97.96 144.56 98.00 145.09
  Q 98.17 147.27 96.04 148.12
  Q 91.99 149.74 88.02 151.11
  A 2.08 2.08 0.0 0 0 87.03 154.32
  Q 89.20 157.24 91.77 160.07
  Q 95.14 163.78 91.00 166.47
  Q 90.02 167.11 88.96 167.39
  Q 88.33 167.56 88.78 168.02
  L 89.02 168.27
  Q 89.33 168.60 89.36 169.05
  C 89.70 173.44 90.12 179.04 88.63 183.18
  Q 87.95 185.06 88.30 187.32
  A 2.30 2.30 0.0 0 1 86.97 189.77
  Q 80.34 192.76 73.14 193.39
  C 71.69 193.51 70.46 193.06 69.07 192.82
  A 1.31 1.30 34.5 0 0 68.19 192.98
  C 65.09 194.80 63.14 197.32 59.74 198.83
  Q 54.61 201.12 49.24 204.21
  C 47.81 205.03 46.51 205.20 44.97 205.59
  A 1.45 1.44 -16.1 0 0 43.95 207.43
  Q 44.21 208.26 45.03 208.66
  A 0.66 0.65 -58.3 0 0 45.85 208.46
  C 46.45 207.62 47.49 207.31 48.46 207.68
  Q 50.21 208.34 51.95 207.60
  Q 52.48 207.37 53.05 207.50
  Q 55.46 208.02 58.03 207.62
  C 63.82 206.72 65.39 212.63 61.50 215.79
  Q 59.47 217.43 57.97 219.30
  Q 57.54 219.85 56.86 220.02
  Q 54.03 220.72 54.01 224.62
  Q 54.00 225.21 54.47 225.59
  L 55.98 226.81
  Q 56.54 227.26 57.25 227.25
  L 60.85 227.20
  A 2.24 2.24 0.0 0 1 63.00 228.69
  L 64.65 233.36
  Q 64.83 233.87 64.63 234.36
  C 63.71 236.59 63.11 239.24 61.42 241.03
  Q 59.39 243.16 57.54 245.51
  A 1.25 1.25 0.0 0 0 57.63 247.15
  Q 61.93 251.58 58.60 257.21
  Q 53.42 265.98 43.73 271.73
  A 0.90 0.90 0.0 0 0 43.69 273.25
  C 46.52 275.13 53.49 279.20 50.58 283.53
  Q 46.01 290.31 42.28 297.82
  C 40.69 301.01 40.05 304.41 38.66 307.67
  C 34.25 317.96 29.90 327.14 24.04 336.67
  Q 20.15 343.00 17.24 351.30
  C 16.57 353.22 18.85 354.29 17.23 356.40
  Q 15.64 358.46 18.22 358.15
  C 19.83 357.96 21.11 357.29 22.62 358.40
  A 1.51 1.50 36.8 0 1 22.93 360.54
  C 21.27 362.66 19.51 364.28 18.19 366.71
  Q 14.00 374.38 11.30 380.35
  Q 9.86 383.55 9.02 387.77
  C 8.67 389.48 7.41 390.69 7.01 392.50
  Q 6.44 395.03 5.19 397.49
  Q 4.94 397.96 5.23 398.42
  L 6.21 400.00
  L 1.92 400.00
  L 1.18 399.60
  Q 0.70 399.34 0.88 398.82
  Q 1.60 396.80 1.98 394.43
  C 2.51 391.14 4.22 388.38 4.97 385.18
  Q 5.52 382.79 6.59 380.56
  C 9.30 374.87 11.16 368.74 14.99 363.59
  A 1.66 1.65 40.4 0 0 14.81 361.40
  L 12.56 359.24
  Q 12.14 358.83 12.25 358.26
  Q 14.78 345.59 16.65 341.85
  Q 23.03 329.04 29.61 316.43
  C 33.45 309.06 35.92 301.62 39.36 294.20
  Q 40.52 291.71 42.57 289.14
  Q 45.11 285.95 46.13 281.50
  A 1.72 1.70 24.8 0 0 45.47 279.74
  C 42.56 277.59 39.15 274.54 35.66 273.76
  Q 34.88 273.59 34.84 272.80
  Q 34.67 270.03 37.77 269.20
  Q 41.46 268.21 44.38 266.04
  C 49.21 262.44 53.87 258.90 56.55 253.42
  A 1.20 1.20 0.0 0 0 55.45 251.70
  L 52.54 251.76
  Q 51.96 251.77 51.77 251.23
  Q 50.96 248.95 52.28 247.04
  Q 56.22 241.36 60.21 233.95
  A 1.07 1.07 0.0 0 0 59.65 232.44
  L 51.53 229.29
  A 2.32 2.31 -87.2 0 1 50.13 227.74
  C 49.37 224.94 49.18 221.67 51.47 219.41
  Q 54.46 216.44 57.27 213.74
  Q 59.62 211.47 56.37 211.84
  C 54.19 212.09 51.88 212.71 49.70 212.30
  Q 46.77 211.75 43.46 211.70
  C 39.56 211.64 38.20 206.24 41.29 204.17
  Q 46.14 200.92 51.59 198.84
  Q 55.87 197.20 60.87 192.82
  Q 61.36 192.39 61.06 191.80
  C 59.42 188.56 55.98 189.10 53.79 186.71
  Q 51.38 184.09 48.72 181.30
  Q 46.53 179.00 44.71 173.79
  C 44.07 171.93 44.55 170.31 43.93 168.52
  Q 43.57 167.50 43.66 166.44
  Q 43.96 162.77 44.31 158.96
  Q 45.34 147.78 52.45 137.04
  C 56.78 130.50 62.50 126.35 69.89 124.12
  Q 76.89 122.00 83.78 121.64
  Q 86.94 121.47 89.31 120.83
  C 90.79 120.42 92.04 120.60 93.51 120.54
  A 0.93 0.93 0.0 0 0 94.38 119.80
  C 95.12 116.32 95.85 113.57 98.60 111.07
  C 104.73 105.46 110.35 98.64 117.19 94.25
  Q 123.06 90.49 128.91 88.29
  Q 137.37 85.12 146.16 83.33
  Q 152.75 81.98 157.53 79.86
  Q 159.46 79.00 161.59 78.83
  Q 163.71 78.66 165.78 78.34
  Q 166.89 79.75 168.14 78.86
  Q 169.66 77.77 168.06 77.16
  Q 168.20 76.57 167.78 76.25
  Q 162.86 72.63 163.08 66.55
  Q 163.16 64.39 164.65 62.96
  A 0.89 0.89 0.0 0 1 166.15 63.54
  L 166.26 65.26
  Z
  M 73.9177 127.1202
  A 0.27 0.27 0.0 0 0 73.5456 127.0343
  L 64.5055 132.6832
  A 0.27 0.27 0.0 0 0 64.4196 133.0553
  L 64.8223 133.6998
  A 0.27 0.27 0.0 0 0 65.1944 133.7857
  L 74.2345 128.1368
  A 0.27 0.27 0.0 0 0 74.3204 127.7647
  L 73.9177 127.1202
  Z
  M 70.52 136.17
  L 70.86 137.08
  A 0.12 0.12 0.0 0 0 71.02 137.15
  L 83.41 132.52
  A 0.60 0.27 69.5 0 0 83.45 131.86
  L 83.45 131.85
  A 0.60 0.27 69.5 0 0 82.98 131.38
  L 70.59 136.01
  A 0.12 0.12 0.0 0 0 70.52 136.17
  Z
  M 66.31 141.13
  Q 67.23 140.72 68.07 140.05
  Q 68.51 139.70 68.48 139.17
  Q 68.45 138.52 67.83 138.72
  Q 66.46 139.15 66.18 140.53
  A 1.22 1.21 -11.1 0 1 65.65 141.31
  L 63.52 142.70
  Q 62.97 143.06 63.02 143.71
  L 63.06 144.21
  Q 63.13 145.05 63.82 144.57
  Q 65.12 143.64 65.67 141.86
  Q 65.82 141.35 66.31 141.13
  Z
  M 86.42 143.28
  L 86.36 142.30
  A 0.23 0.23 0.0 0 0 86.12 142.09
  L 85.95 142.10
  A 7.04 0.58 -3.5 0 0 78.96 143.11
  L 78.98 143.39
  A 7.04 0.58 -3.5 0 0 86.04 143.54
  L 86.21 143.53
  A 0.23 0.23 0.0 0 0 86.42 143.28
  Z
  M 70.77 165.28
  Q 70.09 164.89 69.61 164.18
  A 0.58 0.57 55.2 0 0 68.81 164.03
  Q 68.22 164.44 68.37 165.16
  C 68.91 167.86 68.99 170.86 70.64 173.21
  Q 72.90 176.44 75.88 178.81
  Q 78.23 180.68 75.23 180.69
  C 73.00 180.69 71.38 180.09 69.40 181.75
  Q 69.08 182.01 68.67 182.03
  C 64.41 182.23 60.57 177.68 59.91 174.16
  Q 59.72 173.16 58.73 172.93
  L 57.26 172.59
  Q 56.01 172.30 56.65 173.41
  Q 57.96 175.70 58.00 178.19
  A 1.27 1.25 23.3 0 0 58.36 179.07
  Q 63.02 183.92 69.29 187.48
  C 74.44 190.40 81.16 188.47 86.29 185.88
  A 1.49 1.48 -16.9 0 0 87.10 184.37
  Q 86.69 181.06 86.90 177.48
  C 87.06 174.84 86.87 171.64 84.85 169.69
  C 82.86 167.77 81.52 165.67 81.78 162.73
  Q 81.80 162.49 81.59 162.35
  L 78.61 160.42
  Q 78.45 160.32 78.41 160.51
  C 77.53 165.25 79.72 168.81 82.72 172.22
  A 1.53 1.53 0.0 0 1 81.63 174.76
  Q 80.36 174.81 79.26 173.99
  C 74.02 170.07 72.45 163.23 73.53 157.09
  Q 74.22 153.12 75.28 149.42
  C 75.71 147.92 76.60 146.62 77.40 145.30
  Q 78.36 143.70 77.04 145.02
  Q 73.56 148.54 72.04 153.42
  Q 70.74 157.56 71.50 164.80
  Q 71.60 165.75 70.77 165.28
  Z
  M 59.10 150.93
  Q 60.22 149.49 61.40 148.14
  Q 61.92 147.56 61.67 146.83
  Q 61.46 146.25 60.88 146.44
  L 57.82 147.46
  Q 57.29 147.63 57.21 148.18
  L 56.93 150.00
  Q 56.85 150.51 56.56 150.93
  Q 54.84 153.43 53.83 156.36
  Q 53.63 156.94 54.22 157.11
  Q 54.67 157.25 55.08 156.93
  Q 55.83 156.36 55.92 155.43
  Q 56.05 154.09 57.28 153.54
  A 1.10 1.08 -33.7 0 1 58.52 153.78
  Q 59.38 154.68 60.56 155.12
  A 0.75 0.75 0.0 0 0 61.46 154.82
  Q 62.14 153.75 62.31 152.59
  A 0.66 0.66 0.0 0 0 61.68 151.84
  L 59.48 151.74
  A 0.50 0.50 0.0 0 1 59.10 150.93
  Z
  M 79.84 153.10
  C 79.89 152.80 79.98 152.57 80.12 152.29
  Q 80.52 151.42 79.73 151.96
  Q 79.06 152.43 78.83 153.25
  A 0.43 0.42 -11.9 0 0 79.51 153.69
  Q 79.77 153.47 79.84 153.10
  Z
  M 67.5547 153.8053
  A 0.76 0.53 83.6 0 0 67.9967 152.9909
  A 0.76 0.53 83.6 0 0 67.3853 152.2947
  A 0.76 0.53 83.6 0 0 66.9433 153.1091
  A 0.76 0.53 83.6 0 0 67.5547 153.8053
  Z
  M 84.46 157.22
  A 0.33 0.33 0.0 0 0 83.89 157.50
  L 84.80 161.86
  A 0.33 0.33 0.0 0 0 84.93 162.05
  L 87.76 164.19
  A 0.33 0.33 0.0 0 0 88.29 163.97
  L 88.55 162.02
  A 0.33 0.33 0.0 0 0 88.47 161.76
  L 84.46 157.22
  Z
  M 64.87 158.84
  Q 65.10 158.25 64.48 158.37
  Q 62.59 158.74 61.09 157.80
  A 2.22 2.20 -42.9 0 0 58.90 157.73
  Q 56.90 158.78 54.59 159.08
  Q 54.06 159.14 54.06 159.68
  L 54.07 159.95
  Q 54.07 160.15 54.26 160.18
  Q 56.25 160.45 58.27 159.87
  C 60.16 159.33 62.19 159.53 64.11 159.76
  Q 64.48 159.81 64.61 159.46
  L 64.87 158.84
  Z
  M 61.62 162.72
  Q 63.30 164.14 63.02 166.41
  C 62.41 171.35 63.47 176.87 68.36 178.85
  Q 68.85 179.06 69.26 178.70
  Q 69.78 178.26 69.30 177.77
  C 67.08 175.53 65.27 172.99 65.22 169.68
  C 65.20 167.82 65.17 163.45 64.27 161.98
  Q 63.96 161.47 63.39 161.64
  L 61.74 162.14
  Q 61.15 162.32 61.62 162.72
  Z
  M 57.18 167.87
  C 55.59 167.10 56.34 165.09 58.07 165.09
  A 1.98 1.96 19.7 0 0 59.55 164.40
  L 60.91 162.81
  Q 61.49 162.13 60.65 162.44
  L 55.76 164.24
  Q 55.12 164.47 55.18 165.15
  C 55.36 167.14 56.47 171.29 59.48 170.35
  Q 61.49 169.72 59.54 168.92
  Q 58.36 168.44 57.18 167.87
  Z"
/>
<path d="
  M 185.34 100.58
  Q 191.58 101.97 194.42 106.62
  Q 197.90 112.33 198.26 116.63
  Q 198.57 120.38 199.23 124.14
  A 1.15 1.10 -35.7 0 1 199.09 124.90
  Q 197.80 127.12 195.37 128.24
  Q 188.39 131.46 180.68 129.23
  Q 168.26 125.63 169.74 112.54
  C 170.15 108.91 171.12 102.92 174.83 101.30
  Q 179.48 99.27 185.34 100.58
  Z
  M 192.66 113.50
  C 193.73 109.80 191.61 105.75 188.71 103.54
  A 3.95 3.94 -45.5 0 0 183.86 103.58
  Q 183.75 103.67 183.65 103.76
  Q 182.02 105.19 183.48 106.78
  Q 186.91 110.54 190.93 114.02
  A 1.07 1.07 0.0 0 0 192.66 113.50
  Z"
/>
<path d="
  M 246.67 196.09
  C 239.26 198.34 231.16 199.66 223.49 199.37
  Q 213.08 198.98 203.82 192.52
  Q 202.35 191.50 202.16 189.63
  Q 202.08 188.87 203.27 188.74
  A 1.49 1.47 -33.2 0 1 204.15 188.92
  Q 216.99 195.92 224.95 195.50
  C 229.09 195.28 233.37 195.27 237.43 194.48
  C 246.52 192.69 271.90 187.01 273.08 175.35
  Q 273.45 171.72 273.98 168.08
  C 275.09 160.41 266.17 154.39 260.60 150.95
  C 253.47 146.54 245.99 143.05 239.20 138.40
  Q 237.46 137.20 239.56 137.02
  Q 240.45 136.94 241.28 137.01
  Q 241.98 137.07 241.87 136.38
  Q 240.84 130.08 241.83 125.62
  C 242.58 122.22 248.63 120.48 251.49 120.19
  Q 260.56 119.24 274.08 119.46
  Q 276.71 119.51 279.14 120.14
  C 284.33 121.49 289.74 117.83 293.94 123.24
  Q 298.42 128.99 302.26 134.53
  A 1.57 1.56 -41.1 0 1 302.12 136.47
  C 297.39 141.63 292.05 146.32 288.31 152.09
  Q 285.53 156.36 282.11 159.85
  A 2.70 2.68 -19.8 0 0 281.35 161.45
  Q 280.74 167.36 280.93 173.99
  Q 281.01 176.98 282.67 179.90
  Q 284.61 183.30 286.67 185.35
  C 290.54 189.19 295.17 189.85 300.09 191.09
  Q 307.25 192.90 316.72 191.17
  Q 325.66 189.55 330.38 183.68
  A 0.42 0.41 -31.6 0 1 331.11 183.85
  Q 332.12 188.53 328.01 191.11
  C 320.33 195.93 312.13 197.08 303.01 195.99
  A 2.33 2.33 0.0 0 0 300.78 197.04
  Q 299.69 198.71 299.22 200.69
  Q 297.05 209.66 298.90 216.98
  A 1.31 1.27 -33.3 0 1 298.65 218.11
  Q 297.35 219.68 295.32 219.39
  C 285.53 218.02 276.07 218.94 266.28 219.01
  C 264.73 219.03 263.10 219.70 261.59 219.37
  Q 256.74 218.31 252.83 220.05
  A 0.84 0.84 0.0 0 1 251.75 219.67
  C 247.98 212.48 247.77 204.80 247.65 196.81
  A 0.76 0.76 0.0 0 0 246.67 196.09
  Z
  M 271.70 188.21
  C 266.27 192.07 260.98 194.89 254.22 195.62
  A 1.47 1.46 -4.4 0 0 252.91 197.14
  Q 253.25 204.70 254.62 212.75
  A 1.95 1.93 -7.5 0 0 256.72 214.35
  L 271.75 212.87
  A 1.55 1.55 0.0 0 0 273.15 211.27
  L 272.25 188.48
  Q 272.22 187.84 271.70 188.21
  Z
  M 294.62 195.30
  A 0.90 0.90 0.0 0 0 294.05 194.41
  L 280.47 189.18
  A 0.90 0.90 0.0 0 0 279.24 190.02
  L 279.43 212.51
  A 0.90 0.90 0.0 0 0 280.21 213.39
  L 292.54 215.16
  A 0.90 0.90 0.0 0 0 293.56 214.32
  L 294.62 195.30
  Z"
/>
</g>
<g fill="#ffe4be">
<path d="
  M 188.71 103.54
  C 191.61 105.75 193.73 109.80 192.66 113.50
  A 1.07 1.07 0.0 0 1 190.93 114.02
  Q 186.91 110.54 183.48 106.78
  Q 182.02 105.19 183.65 103.76
  Q 183.75 103.67 183.86 103.58
  A 3.95 3.94 -45.5 0 1 188.71 103.54
  Z"
/>
<path d="
  M 297.82 107.50
  A 0.12 0.12 0.0 0 1 297.85 107.33
  L 297.89 107.30
  A 3.78 3.23 55.4 0 1 302.69 108.58
  L 302.86 108.83
  A 3.78 3.23 55.4 0 1 302.35 113.77
  L 302.31 113.80
  A 0.12 0.12 0.0 0 1 302.14 113.77
  L 297.82 107.50
  Z"
/>
<path d="
  M 254.22 195.62
  C 260.98 194.89 266.27 192.07 271.70 188.21
  Q 272.22 187.84 272.25 188.48
  L 273.15 211.27
  A 1.55 1.55 0.0 0 1 271.75 212.87
  L 256.72 214.35
  A 1.95 1.93 -7.5 0 1 254.62 212.75
  Q 253.25 204.70 252.91 197.14
  A 1.47 1.46 -4.4 0 1 254.22 195.62
  Z"
/>
<path d="
  M 294.62 195.30
  L 293.56 214.32
  A 0.90 0.90 0.0 0 1 292.54 215.16
  L 280.21 213.39
  A 0.90 0.90 0.0 0 1 279.43 212.51
  L 279.24 190.02
  A 0.90 0.90 0.0 0 1 280.47 189.18
  L 294.05 194.41
  A 0.90 0.90 0.0 0 1 294.62 195.30
  Z"
/>
</g>
<g fill="#a03421">
<path d="
  M 168.88 64.41
  Q 174.97 71.04 183.78 70.71
  Q 189.11 70.50 190.43 70.61
  Q 197.47 71.17 204.45 71.85
  Q 212.90 72.66 219.45 72.98
  Q 226.93 73.35 234.45 73.74
  C 244.64 74.27 254.84 77.29 264.79 81.88
  C 271.67 85.06 278.66 87.79 285.18 91.43
  C 290.69 94.50 295.29 97.50 299.18 102.75
  A 0.69 0.69 0.0 0 1 299.00 103.74
  Q 297.01 105.02 294.56 105.47
  L 294.23 104.38
  Q 294.09 103.89 293.60 103.74
  Q 282.59 100.27 271.74 96.14
  C 268.33 94.84 264.77 94.82 261.25 94.45
  Q 256.62 93.97 252.66 93.08
  Q 240.37 90.32 229.33 88.42
  Q 221.81 87.12 210.77 87.01
  Q 204.46 86.94 199.30 87.78
  Q 193.77 88.67 187.90 89.49
  Q 179.89 90.61 174.14 94.80
  Q 165.92 100.79 158.18 106.70
  Q 140.80 119.98 128.50 136.07
  C 127.51 137.35 126.73 138.83 126.28 140.39
  Q 122.14 154.60 119.95 171.75
  Q 119.56 174.79 120.65 176.89
  C 124.56 184.42 125.06 192.09 125.02 200.25
  C 124.96 210.85 123.88 220.23 115.92 227.89
  A 2.33 2.32 -32.1 0 0 115.35 230.35
  C 118.00 237.68 121.42 244.52 123.47 251.90
  Q 127.69 267.12 136.20 279.84
  Q 137.35 281.57 136.12 283.19
  Q 132.00 288.56 126.96 284.66
  Q 125.37 283.43 124.41 281.40
  A 0.26 0.26 0.0 0 0 124.05 281.28
  L 123.82 281.41
  Q 123.42 281.64 123.66 282.03
  L 125.14 284.47
  A 2.22 2.19 -54.5 0 1 125.40 286.08
  C 124.83 288.68 123.69 291.56 124.38 294.20
  Q 124.50 294.68 125.64 297.79
  Q 131.47 313.73 142.15 326.75
  C 144.79 329.96 147.25 333.42 149.50 336.74
  C 150.16 337.72 151.12 338.45 152.10 339.11
  Q 152.75 339.55 151.98 339.73
  Q 151.77 339.78 151.58 339.70
  Q 144.78 336.79 136.90 334.95
  Q 133.27 334.11 127.89 329.98
  Q 125.63 328.25 123.61 330.24
  L 123.26 330.58
  A 1.93 1.92 43.3 0 0 123.35 333.40
  C 126.68 336.29 132.69 341.24 133.46 345.28
  A 2.00 2.00 0.0 0 1 133.26 346.59
  C 130.42 351.98 132.20 356.97 134.86 362.04
  Q 138.48 368.94 144.03 375.99
  Q 153.43 387.92 162.88 400.00
  L 6.21 400.00
  L 5.23 398.42
  Q 4.94 397.96 5.19 397.49
  Q 6.44 395.03 7.01 392.50
  C 7.41 390.69 8.67 389.48 9.02 387.77
  Q 9.86 383.55 11.30 380.35
  Q 14.00 374.38 18.19 366.71
  C 19.51 364.28 21.27 362.66 22.93 360.54
  A 1.51 1.50 36.8 0 0 22.62 358.40
  C 21.11 357.29 19.83 357.96 18.22 358.15
  Q 15.64 358.46 17.23 356.40
  C 18.85 354.29 16.57 353.22 17.24 351.30
  Q 20.15 343.00 24.04 336.67
  C 29.90 327.14 34.25 317.96 38.66 307.67
  C 40.05 304.41 40.69 301.01 42.28 297.82
  Q 46.01 290.31 50.58 283.53
  C 53.49 279.20 46.52 275.13 43.69 273.25
  A 0.90 0.90 0.0 0 1 43.73 271.73
  Q 53.42 265.98 58.60 257.21
  Q 61.93 251.58 57.63 247.15
  A 1.25 1.25 0.0 0 1 57.54 245.51
  Q 59.39 243.16 61.42 241.03
  C 63.11 239.24 63.71 236.59 64.63 234.36
  Q 64.83 233.87 64.65 233.36
  L 63.00 228.69
  A 2.24 2.24 0.0 0 0 60.85 227.20
  L 57.25 227.25
  Q 56.54 227.26 55.98 226.81
  L 54.47 225.59
  Q 54.00 225.21 54.01 224.62
  Q 54.03 220.72 56.86 220.02
  Q 57.54 219.85 57.97 219.30
  Q 59.47 217.43 61.50 215.79
  C 65.39 212.63 63.82 206.72 58.03 207.62
  Q 55.46 208.02 53.05 207.50
  Q 52.48 207.37 51.95 207.60
  Q 50.21 208.34 48.46 207.68
  C 47.49 207.31 46.45 207.62 45.85 208.46
  A 0.66 0.65 -58.3 0 1 45.03 208.66
  Q 44.21 208.26 43.95 207.43
  A 1.45 1.44 -16.1 0 1 44.97 205.59
  C 46.51 205.20 47.81 205.03 49.24 204.21
  Q 54.61 201.12 59.74 198.83
  C 63.14 197.32 65.09 194.80 68.19 192.98
  A 1.31 1.30 34.5 0 1 69.07 192.82
  C 70.46 193.06 71.69 193.51 73.14 193.39
  Q 80.34 192.76 86.97 189.77
  A 2.30 2.30 0.0 0 0 88.30 187.32
  Q 87.95 185.06 88.63 183.18
  C 90.12 179.04 89.70 173.44 89.36 169.05
  Q 89.33 168.60 89.02 168.27
  L 88.78 168.02
  Q 88.33 167.56 88.96 167.39
  Q 90.02 167.11 91.00 166.47
  Q 95.14 163.78 91.77 160.07
  Q 89.20 157.24 87.03 154.32
  A 2.08 2.08 0.0 0 1 88.02 151.11
  Q 91.99 149.74 96.04 148.12
  Q 98.17 147.27 98.00 145.09
  Q 97.96 144.56 97.45 144.43
  Q 91.49 142.84 89.73 136.19
  Q 89.59 135.67 89.94 135.26
  Q 90.52 134.54 90.73 133.66
  Q 90.94 132.78 90.03 132.75
  Q 88.68 132.70 88.54 133.98
  Q 88.50 134.40 88.09 134.32
  L 87.78 134.27
  Q 87.53 134.22 87.60 133.97
  L 88.66 130.21
  A 0.67 0.67 0.0 0 0 88.06 129.36
  C 86.64 129.27 85.24 129.21 83.98 128.50
  Q 82.50 127.66 81.07 127.24
  Q 76.18 125.80 81.29 125.59
  Q 86.59 125.38 92.68 125.28
  C 94.15 125.26 95.71 125.79 97.18 125.63
  A 0.82 0.82 0.0 0 0 97.88 125.08
  Q 99.35 120.98 100.68 117.07
  C 101.61 114.36 103.64 112.82 105.86 111.21
  C 108.64 109.20 110.85 105.40 112.71 103.72
  Q 117.77 99.16 127.22 94.08
  Q 130.81 92.15 134.98 91.01
  C 138.58 90.03 142.09 88.70 145.71 87.84
  Q 155.89 85.41 166.81 82.41
  C 169.50 81.67 171.82 80.32 174.58 79.92
  Q 175.42 79.80 174.68 79.39
  Q 174.16 79.11 173.61 78.93
  Q 172.99 78.73 172.77 78.12
  C 171.22 73.62 167.02 72.39 165.23 67.95
  Q 165.05 67.50 165.19 67.04
  Q 165.51 66.02 166.26 65.26
  L 168.88 64.41
  Z"
/>
<path d="
  M 168.06 77.16
  Q 169.66 77.77 168.14 78.86
  Q 166.89 79.75 165.78 78.34
  L 168.06 77.16
  Z"
/>
<rect x="-5.60" y="-0.65" transform="translate(69.37,130.41) rotate(-32.0)" width="11.20" height="1.30" rx="0.27"/>
<path d="
  M 70.52 136.17
  A 0.12 0.12 0.0 0 1 70.59 136.01
  L 82.98 131.38
  A 0.60 0.27 69.5 0 1 83.45 131.85
  L 83.45 131.86
  A 0.60 0.27 69.5 0 1 83.41 132.52
  L 71.02 137.15
  A 0.12 0.12 0.0 0 1 70.86 137.08
  L 70.52 136.17
  Z"
/>
<path d="
  M 65.67 141.86
  Q 65.12 143.64 63.82 144.57
  Q 63.13 145.05 63.06 144.21
  L 63.02 143.71
  Q 62.97 143.06 63.52 142.70
  L 65.65 141.31
  A 1.22 1.21 -11.1 0 0 66.18 140.53
  Q 66.46 139.15 67.83 138.72
  Q 68.45 138.52 68.48 139.17
  Q 68.51 139.70 68.07 140.05
  Q 67.23 140.72 66.31 141.13
  Q 65.82 141.35 65.67 141.86
  Z"
/>
<path d="
  M 86.42 143.28
  A 0.23 0.23 0.0 0 1 86.21 143.53
  L 86.04 143.54
  A 7.04 0.58 -3.5 0 1 78.98 143.39
  L 78.96 143.11
  A 7.04 0.58 -3.5 0 1 85.95 142.10
  L 86.12 142.09
  A 0.23 0.23 0.0 0 1 86.36 142.30
  L 86.42 143.28
  Z"
/>
<path d="
  M 71.50 164.80
  Q 70.74 157.56 72.04 153.42
  Q 73.56 148.54 77.04 145.02
  Q 78.36 143.70 77.40 145.30
  C 76.60 146.62 75.71 147.92 75.28 149.42
  Q 74.22 153.12 73.53 157.09
  C 72.45 163.23 74.02 170.07 79.26 173.99
  Q 80.36 174.81 81.63 174.76
  A 1.53 1.53 0.0 0 0 82.72 172.22
  C 79.72 168.81 77.53 165.25 78.41 160.51
  Q 78.45 160.32 78.61 160.42
  L 81.59 162.35
  Q 81.80 162.49 81.78 162.73
  C 81.52 165.67 82.86 167.77 84.85 169.69
  C 86.87 171.64 87.06 174.84 86.90 177.48
  Q 86.69 181.06 87.10 184.37
  A 1.49 1.48 -16.9 0 1 86.29 185.88
  C 81.16 188.47 74.44 190.40 69.29 187.48
  Q 63.02 183.92 58.36 179.07
  A 1.27 1.25 23.3 0 1 58.00 178.19
  Q 57.96 175.70 56.65 173.41
  Q 56.01 172.30 57.26 172.59
  L 58.73 172.93
  Q 59.72 173.16 59.91 174.16
  C 60.57 177.68 64.41 182.23 68.67 182.03
  Q 69.08 182.01 69.40 181.75
  C 71.38 180.09 73.00 180.69 75.23 180.69
  Q 78.23 180.68 75.88 178.81
  Q 72.90 176.44 70.64 173.21
  C 68.99 170.86 68.91 167.86 68.37 165.16
  Q 68.22 164.44 68.81 164.03
  A 0.58 0.57 55.2 0 1 69.61 164.18
  Q 70.09 164.89 70.77 165.28
  Q 71.60 165.75 71.50 164.80
  Z"
/>
<path d="
  M 59.10 150.93
  A 0.50 0.50 0.0 0 0 59.48 151.74
  L 61.68 151.84
  A 0.66 0.66 0.0 0 1 62.31 152.59
  Q 62.14 153.75 61.46 154.82
  A 0.75 0.75 0.0 0 1 60.56 155.12
  Q 59.38 154.68 58.52 153.78
  A 1.10 1.08 -33.7 0 0 57.28 153.54
  Q 56.05 154.09 55.92 155.43
  Q 55.83 156.36 55.08 156.93
  Q 54.67 157.25 54.22 157.11
  Q 53.63 156.94 53.83 156.36
  Q 54.84 153.43 56.56 150.93
  Q 56.85 150.51 56.93 150.00
  L 57.21 148.18
  Q 57.29 147.63 57.82 147.46
  L 60.88 146.44
  Q 61.46 146.25 61.67 146.83
  Q 61.92 147.56 61.40 148.14
  Q 60.22 149.49 59.10 150.93
  Z"
/>
<path d="
  M 79.84 153.10
  Q 79.77 153.47 79.51 153.69
  A 0.43 0.42 -11.9 0 1 78.83 153.25
  Q 79.06 152.43 79.73 151.96
  Q 80.52 151.42 80.12 152.29
  C 79.98 152.57 79.89 152.80 79.84 153.10
  Z"
/>
<ellipse cx="0.00" cy="0.00" transform="translate(67.47,153.05) rotate(83.6)" rx="0.76" ry="0.53"/>
<path d="
  M 84.46 157.22
  L 88.47 161.76
  A 0.33 0.33 0.0 0 1 88.55 162.02
  L 88.29 163.97
  A 0.33 0.33 0.0 0 1 87.76 164.19
  L 84.93 162.05
  A 0.33 0.33 0.0 0 1 84.80 161.86
  L 83.89 157.50
  A 0.33 0.33 0.0 0 1 84.46 157.22
  Z"
/>
<path d="
  M 64.87 158.84
  L 64.61 159.46
  Q 64.48 159.81 64.11 159.76
  C 62.19 159.53 60.16 159.33 58.27 159.87
  Q 56.25 160.45 54.26 160.18
  Q 54.07 160.15 54.07 159.95
  L 54.06 159.68
  Q 54.06 159.14 54.59 159.08
  Q 56.90 158.78 58.90 157.73
  A 2.22 2.20 -42.9 0 1 61.09 157.80
  Q 62.59 158.74 64.48 158.37
  Q 65.10 158.25 64.87 158.84
  Z"
/>
<path d="
  M 344.11 161.14
  Q 346.00 168.18 348.41 175.20
  Q 351.57 184.41 352.54 189.27
  Q 355.03 201.70 354.81 214.44
  C 354.75 217.73 353.40 221.01 351.36 223.68
  Q 345.89 230.80 340.64 237.69
  C 336.48 243.14 332.96 248.71 329.33 254.55
  Q 326.76 258.69 324.80 262.49
  C 322.06 267.81 319.08 272.89 316.57 278.37
  C 313.94 284.12 310.88 289.10 309.45 295.69
  C 308.67 299.29 306.69 301.96 306.15 305.84
  Q 306.08 306.35 306.35 306.77
  A 0.42 0.42 0.0 0 0 307.08 306.74
  Q 311.85 297.39 316.20 289.50
  Q 316.90 288.23 318.01 287.24
  Q 318.61 286.70 318.99 287.42
  Q 321.96 293.15 324.17 299.32
  Q 325.59 303.27 327.77 306.31
  Q 334.81 316.11 336.86 318.17
  Q 339.46 320.77 342.36 323.47
  Q 344.28 325.27 341.65 325.30
  Q 338.39 325.35 335.39 324.71
  Q 334.97 324.63 334.81 325.02
  C 332.90 329.78 339.99 335.33 343.34 337.69
  C 347.94 340.92 352.14 344.76 355.87 348.70
  Q 369.53 363.14 373.41 367.68
  Q 379.16 374.42 385.56 382.68
  Q 391.82 390.75 396.35 400.00
  L 223.19 400.00
  Q 253.67 373.86 272.99 339.43
  Q 275.37 335.18 277.42 333.33
  Q 281.41 329.74 285.65 325.99
  A 0.35 0.34 -44.4 0 0 285.66 325.49
  L 285.46 325.29
  Q 285.37 325.20 285.26 325.28
  L 281.41 327.85
  Q 280.11 328.72 278.98 327.63
  Q 278.55 327.21 278.67 326.32
  A 1.23 1.22 -17.4 0 1 279.06 325.58
  C 281.86 323.02 285.27 321.58 287.41 318.31
  Q 290.52 313.58 293.47 308.47
  Q 294.29 307.06 292.89 306.21
  Q 289.62 304.24 286.00 302.88
  C 281.20 301.07 277.40 296.43 274.37 292.44
  Q 273.05 290.69 274.92 289.56
  Q 286.57 282.48 294.09 270.78
  C 294.83 269.64 296.24 268.08 297.38 267.40
  Q 312.84 258.07 323.29 242.23
  Q 329.32 233.10 333.19 226.21
  C 336.42 220.46 337.44 214.72 339.04 208.57
  C 342.14 196.67 339.70 185.30 336.28 172.76
  C 335.07 168.33 334.67 160.07 341.86 160.93
  Q 342.95 161.06 344.11 161.14
  Z"
/>
<path d="
  M 61.62 162.72
  Q 61.15 162.32 61.74 162.14
  L 63.39 161.64
  Q 63.96 161.47 64.27 161.98
  C 65.17 163.45 65.20 167.82 65.22 169.68
  C 65.27 172.99 67.08 175.53 69.30 177.77
  Q 69.78 178.26 69.26 178.70
  Q 68.85 179.06 68.36 178.85
  C 63.47 176.87 62.41 171.35 63.02 166.41
  Q 63.30 164.14 61.62 162.72
  Z"
/>
<path d="
  M 57.18 167.87
  Q 58.36 168.44 59.54 168.92
  Q 61.49 169.72 59.48 170.35
  C 56.47 171.29 55.36 167.14 55.18 165.15
  Q 55.12 164.47 55.76 164.24
  L 60.65 162.44
  Q 61.49 162.13 60.91 162.81
  L 59.55 164.40
  A 1.98 1.96 19.7 0 1 58.07 165.09
  C 56.34 165.09 55.59 167.10 57.18 167.87
  Z"
/>
</g>
</svg>
