<?xml version="1.0" encoding="UTF-8" standalone="no"?>
<!-- Generator: $$$/GeneralStr/196=Adobe Illustrator 27.6.0, SVG Export Plug-In . SVG Version: 6.00 Build 0)  -->

<svg
   version="1.1"
   id="Calque_1"
   x="0px"
   y="0px"
   viewBox="0 0 120 120"
   xml:space="preserve"
   sodipodi:docname="logo_forge.svg"
   width="120"
   height="120"
   inkscape:version="1.2.2 (732a01da63, 2022-12-09)"
   xmlns:inkscape="http://www.inkscape.org/namespaces/inkscape"
   xmlns:sodipodi="http://sodipodi.sourceforge.net/DTD/sodipodi-0.dtd"
   xmlns="http://www.w3.org/2000/svg"
   xmlns:svg="http://www.w3.org/2000/svg"><defs
   id="defs21" /><sodipodi:namedview
   id="namedview19"
   pagecolor="#ffffff"
   bordercolor="#000000"
   borderopacity="0.25"
   inkscape:showpageshadow="2"
   inkscape:pageopacity="0.0"
   inkscape:pagecheckerboard="0"
   inkscape:deskcolor="#d1d1d1"
   showgrid="false"
   inkscape:zoom="2.4297189"
   inkscape:cx="-17.491735"
   inkscape:cy="86.841321"
   inkscape:window-width="1920"
   inkscape:window-height="1017"
   inkscape:window-x="3832"
   inkscape:window-y="-8"
   inkscape:window-maximized="1"
   inkscape:current-layer="Calque_1" />
<style
   type="text/css"
   id="style2">
	.st0{fill-rule:evenodd;clip-rule:evenodd;fill:#F17361;}
</style>




<circle
   style="fill:#ffffff;stroke-width:1.04163;stop-color:#000000"
   id="path291"
   cx="60"
   cy="60"
   r="60"
   inkscape:export-filename="favicon_merge.png"
   inkscape:export-xdpi="409.60001"
   inkscape:export-ydpi="409.60001" /><g
   id="g309"
   transform="matrix(0.88495575,0,0,0.88495575,16.37525,7.8318582)"><path
     class="st0"
     d="m 59,34.4 c -3.8,0 -6.9,-3.1 -6.9,-6.9 0,-3.8 3.1,-6.9 6.9,-6.9 3.8,0 6.9,3.1 6.9,6.9 0,3.8 -3.1,6.9 -6.9,6.9 z M 59,40 C 52.1,40 46.5,34.4 46.5,27.5 46.5,20.6 52.1,15 59,15 65.9,15 71.5,20.6 71.5,27.5 71.5,34.4 65.9,40 59,40 Z"
     id="path4" /><path
     class="st0"
     d="m 59,97.4 c -3.8,0 -6.9,-3.1 -6.9,-6.9 0,-3.8 3.1,-6.9 6.9,-6.9 3.8,0 6.9,3.1 6.9,6.9 0.1,3.7 -3,6.9 -6.9,6.9 z m 0,5.5 c -6.9,0 -12.5,-5.6 -12.5,-12.5 0,-6.9 5.6,-12.5 12.5,-12.5 6.9,0 12.5,5.6 12.5,12.5 0,6.9 -5.6,12.5 -12.5,12.5 z"
     id="path6" /><path
     class="st0"
     d="m 27.5,52.1 c -3.6,0 -6.9,-3.1 -6.9,-7.4 0,-4.3 3.3,-7.4 6.9,-7.4 3.6,0 6.9,3.1 6.9,7.4 0.1,4.2 -3.2,7.3 -6.9,7.4 z m 0,5.5 C 20.6,57.6 15,51.8 15,44.7 c 0,-7.2 5.6,-13 12.5,-13 6.9,0 12.5,5.8 12.5,12.9 0,7.2 -5.6,13 -12.5,13 z"
     id="path8" /><path
     class="st0"
     d="M 64.1,80.7 V 37.2 h -9.3 v 43.5 z"
     id="path10" /><path
     class="st0"
     d="m 22.4,59.2 c 0.1,4 0.8,9.4 4,14.2 1.9,2.9 4.9,4.8 7.7,6.2 2.9,1.4 6.1,2.3 9.1,3 3,0.7 5.8,1.2 8,1.5 0.7,0.1 1.4,0.2 2,0.3 0.3,0 0.5,0.1 0.7,0.1 0.6,0.1 0.9,0.1 1,0.1 0.1,0 0.1,0 0.1,0 l 2.3,-8.9 c -0.6,-0.2 -1.4,-0.3 -2.1,-0.4 v 0 c -0.3,0 -0.5,-0.1 -0.8,-0.1 C 53.8,75.1 53.2,75 52.5,74.9 50.4,74.6 47.9,74.2 45.2,73.6 42.6,73 40,72.2 38,71.2 c -2.1,-1 -3.4,-2.1 -3.9,-2.9 -1.8,-2.7 -2.4,-6.2 -2.5,-9.3 0,-1.5 0.1,-2.8 0.2,-3.8 0.1,-0.5 0.1,-0.8 0.1,-1.1 0,-0.1 0,-0.2 0,-0.2 0,0 0,0 0,0 v 0 c 0,0 0,0 -4.5,-0.9 C 23,52 23,52 23,52 v 0 0 0 0 c 0,0 0,0.1 0,0.1 0,0.1 0,0.3 -0.1,0.4 -0.1,0.4 -0.1,0.9 -0.2,1.5 -0.2,1.4 -0.3,3.2 -0.3,5.2 z"
     id="path12" /></g>


</svg>
