\relax 
\providecommand\hyper@newdestlabel[2]{}
\providecommand\babel@aux[2]{}
\@nameuse{bbl@beforestart}
\catcode `:\active 
\catcode `;\active 
\catcode `!\active 
\catcode `?\active 
\providecommand\HyperFirstAtBeginDocument{\AtBeginDocument}
\HyperFirstAtBeginDocument{\ifx\hyper@anchor\@undefined
\global\let\oldcontentsline\contentsline
\gdef\contentsline#1#2#3#4{\oldcontentsline{#1}{#2}{#3}}
\global\let\oldnewlabel\newlabel
\gdef\newlabel#1#2{\newlabelxx{#1}#2}
\gdef\newlabelxx#1#2#3#4#5#6{\oldnewlabel{#1}{{#2}{#3}}}
\AtEndDocument{\ifx\hyper@anchor\@undefined
\let\contentsline\oldcontentsline
\let\newlabel\oldnewlabel
\fi}
\fi}
\global\let\hyper@last\relax 
\gdef\HyperFirstAtBeginDocument#1{#1}
\providecommand\HyField@AuxAddToFields[1]{}
\providecommand\HyField@AuxAddToCoFields[2]{}
\babel@aux{french}{}
\@writefile{toc}{\contentsline {section}{\numberline {1}Fonctions récursives}{1}{section.1}\protected@file@percent }
\gdef\minted@oldcachelist{,
  default.pygstyle,
  84A353EDFF03C7278F059B02572F329BBE84C39F3526550906ADFF0657FF4AE7.pygtex,
  B7C10A255F332C6B64E2B940E0BDF968BE84C39F3526550906ADFF0657FF4AE7.pygtex,
  9160A7541040A09126BE4767241B1981BE84C39F3526550906ADFF0657FF4AE7.pygtex,
  986CBFFC72E3CA1EE57FAADD1048B2BBBE84C39F3526550906ADFF0657FF4AE7.pygtex,
  F9518CE916AC31EABB092788A6E9FC9ABE84C39F3526550906ADFF0657FF4AE7.pygtex,
  D95AF7E3FEAF310FB90D6FE8EC8A8A53BE84C39F3526550906ADFF0657FF4AE7.pygtex,
  CC72185F414A55738EE4460AA82802B3BE84C39F3526550906ADFF0657FF4AE7.pygtex,
  B05AB32872822EC31A4E70FC69502BC0BE84C39F3526550906ADFF0657FF4AE7.pygtex,
  B05AB32872822EC31A4E70FC69502BC0BE84C39F3526550906ADFF0657FF4AE7.pygtex,
  B05AB32872822EC31A4E70FC69502BC0BE84C39F3526550906ADFF0657FF4AE7.pygtex,
  2E2535ACA3886FE730596016CAE0116EBE84C39F3526550906ADFF0657FF4AE7.pygtex,
  145283D8BB65CF41F31B9E7EE5E89B90BE84C39F3526550906ADFF0657FF4AE7.pygtex,
  1FDA7C603ED95FFD3AD7697C6D4D2B46BE84C39F3526550906ADFF0657FF4AE7.pygtex,
  2C81E7AA19D6FE8FA4B57DCCC915BEEABE84C39F3526550906ADFF0657FF4AE7.pygtex,
  338A0A120C2698D18F0F2097BA125607BE84C39F3526550906ADFF0657FF4AE7.pygtex,
  088CF78427F146F1C6F2D64DBF0C313BBE84C39F3526550906ADFF0657FF4AE7.pygtex,
  A69C9D95D0D2EADBEA5C2F7BE996C602BE84C39F3526550906ADFF0657FF4AE7.pygtex,
  AEB7FF4F2D79666B2DF9524795592CD9BE84C39F3526550906ADFF0657FF4AE7.pygtex}
\@writefile{toc}{\contentsline {section}{\numberline {2}Nombre d'adhérents}{2}{section.2}\protected@file@percent }
\gdef \@abspage@last{2}
