<?xml version="1.0" encoding="utf-8"?>
<!-- Generator: Adobe Illustrator 28.3.0, SVG Export Plug-In . SVG Version: 6.00 Build 0)  -->
<svg version="1.1" id="Calque_1" xmlns="http://www.w3.org/2000/svg" xmlns:xlink="http://www.w3.org/1999/xlink" x="0px" y="0px"
	 viewBox="0 0 505 505" style="enable-background:new 0 0 505 505;" xml:space="preserve">
<style type="text/css">
	.st0{fill:#303030;stroke:#000000;stroke-width:5;stroke-miterlimit:10;}
	.st1{fill:none;stroke:#000000;stroke-width:2;stroke-miterlimit:10;}
	.st2{enable-background:new    ;}
	.st3{fill:#3C7CB3;}
</style>
<g id="carré_noir">
	<path class="st0" d="M502.5,502.5H2.5V2.5h500V502.5z"/>
</g>
<g id="cylindre_1">
	<ellipse class="st1" cx="254.8" cy="252.5" rx="38.8" ry="249"/>
</g>
<g id="cylindre_2">
	<ellipse class="st1" cx="252.5" cy="238.8" rx="249" ry="47.3"/>
</g>
<g id="cylindre_3">
	
		<ellipse transform="matrix(0.7071 -0.7071 0.7071 0.7071 -105.2449 252.5579)" class="st1" cx="252.2" cy="253.3" rx="48.9" ry="338.9"/>
</g>
<g id="cylindre_4">
	
		<ellipse transform="matrix(0.7071 -0.7071 0.7071 0.7071 -105.3603 252.8134)" class="st1" cx="252.5" cy="253.6" rx="339.1" ry="49"/>
</g>
<g>
	<g class="st2">
		<path class="st3" d="M169.3,148c0-3.1,0-5.9,0-8.3c0-2.4,0-5,0-7.7c0-2.7,0-5.3,0-7.7c0-2.4,0-5.2,0-8.3c3,0,5.6,0,8,0
			c2.4,0,4.9,0,7.5,0c2.7,0,5.2,0,7.7,0c2.4,0,4.5,0,6.2,0c1.7,0,2.6,0,2.9,0c0,0.7,0,1.5,0,2.3c0,0.8,0,1.6,0,2.3
			c-2.5,0-4.7,0-6.6,0s-3.8,0-5.6,0s-4.1,0-6.6,0c-0.1,0-0.5,0.3-1.1,0.9c-0.6,0.6-1.4,1.3-2.3,2.2c-0.9,0.9-1.7,1.8-2.6,2.7
			c-0.8,0.9-1.6,1.7-2.1,2.3c-0.6,0.7-0.9,1-0.9,1.2V148H169.3z M169.3,161.7v-24.1h4.4c0,2.4,0,4.4,0,6s0,3.6,0,6s0,4.4,0,6
			c0,1.6,0,3.6,0,6H169.3z M173.7,151.2v18.3c0,0.1,0.3,0.5,0.9,1.1c0.6,0.7,1.3,1.4,2.1,2.3c0.8,0.9,1.7,1.8,2.6,2.7
			c0.9,0.9,1.6,1.6,2.3,2.2c0.6,0.6,1,0.9,1.1,0.9c2.5,0,4.7,0,6.6,0s3.8,0,5.6,0s4.1,0,6.6,0c0,0.7,0,1.5,0,2.3c0,0.8,0,1.6,0,2.3
			c-0.3,0-1.2,0-2.9,0c-1.7,0-3.7,0-6.2,0c-2.4,0-5,0-7.7,0c-2.7,0-5.2,0-7.5,0c-2.4,0-5,0-8,0c0-3.1,0-5.9,0-8.3c0-2.4,0-5,0-7.7
			c0-2.7,0-5.3,0-7.7c0-2.4,0-5.2,0-8.3H173.7z M198.6,145.4c0-1.3,0-2.7,0-4c0-1.3,0-2.9,0-4.8c0-0.2,0-0.3,0-0.3
			c0-0.1,0.1-0.1,0.1-0.1c0.1,0,0.2,0,0.3,0c0.4,0,0.8,0,1.2,0c0.4,0,0.8,0,1.2,0c0.4,0,0.8,0,1.2,0c0.1,0,0.2,0,0.3,0
			c0.1,0,0.1,0.1,0.1,0.1c0,0.1,0,0.2,0,0.3c0,1.8,0,3.4,0,4.8c0,1.3,0,2.7,0,4c0,1.3,0,2.9,0,4.8c0,1.2,0,2.2,0,3.2s0,1.9,0,2.9
			c0,1,0,2,0,2.9c0,0.9,0,2,0,3.2c0,0.2,0,0.3,0,0.3c0,0.1-0.1,0.1-0.1,0.1c-0.1,0-0.2,0-0.3,0c-0.6,0-1.2,0-1.7,0
			c-0.6,0-1.2,0-1.8,0c-0.1,0-0.2,0-0.3,0c-0.1,0-0.1-0.1-0.1-0.1c0-0.1,0-0.2,0-0.3c0-1.2,0-2.2,0-3.2c0-0.9,0-1.9,0-2.9
			c0-1,0-2,0-2.9s0-2,0-3.2C198.6,148.3,198.6,146.7,198.6,145.4z M227.8,148v-18.3c0-0.1-0.3-0.5-0.9-1.2c-0.6-0.7-1.3-1.4-2.1-2.3
			c-0.8-0.9-1.7-1.8-2.6-2.7c-0.9-0.9-1.6-1.6-2.3-2.2c-0.6-0.6-1-0.9-1.1-0.9c-2.5,0-4.7,0-6.6,0c-1.9,0-3.8,0-5.6,0
			c-1.9,0-4.1,0-6.6,0c0-0.8,0-1.5,0-2.3c0-0.8,0-1.5,0-2.3c0.3,0,1.2,0,2.9,0c1.7,0,3.7,0,6.2,0c2.4,0,5,0,7.7,0c2.7,0,5.2,0,7.5,0
			c2.4,0,5,0,8,0c0,3.1,0,5.9,0,8.3c0,2.4,0,5,0,7.7c0,2.7,0,5.3,0,7.7c0,2.4,0,5.2,0,8.3H227.8z M232.2,151.2c0,3.1,0,5.9,0,8.3
			c0,2.4,0,5,0,7.7c0,2.7,0,5.3,0,7.7c0,2.4,0,5.2,0,8.3c-3,0-5.6,0-8,0c-2.4,0-4.9,0-7.5,0c-2.7,0-5.2,0-7.7,0c-2.4,0-4.5,0-6.2,0
			c-1.7,0-2.6,0-2.9,0c0-0.8,0-1.5,0-2.3c0-0.8,0-1.5,0-2.3c2.5,0,4.7,0,6.6,0c1.9,0,3.8,0,5.6,0c1.9,0,4.1,0,6.6,0
			c0.1,0,0.5-0.3,1.1-0.9c0.6-0.6,1.4-1.3,2.3-2.2c0.9-0.9,1.7-1.8,2.6-2.7c0.8-0.9,1.6-1.7,2.1-2.3c0.6-0.7,0.9-1,0.9-1.1v-18.3
			H232.2z M232.2,161.7h-4.4c0-2.4,0-4.4,0-6c0-1.6,0-3.6,0-6s0-4.4,0-6s0-3.6,0-6h4.4V161.7z"/>
		<path class="st3" d="M227.8,148c0-3.1,0-5.9,0-8.3c0-2.4,0-5,0-7.7c0-2.7,0-5.3,0-7.7c0-2.4,0-5.2,0-8.3c3.1,0,5.9,0,8.3,0
			c2.4,0,5.1,0,7.8,0c2.8,0,5.4,0,7.8,0c2.4,0,5.2,0,8.3,0c0,0.7,0,1.5,0,2.3c0,0.8,0,1.6,0,2.3c-2.7,0-5.1,0-7.2,0
			c-2.1,0-4.4,0-6.7,0c-2.4,0-4.6,0-6.7,0c-2.1,0-4.5,0-7.2,0c0,2.6,0,5,0,7.1c0,2.1,0,4.3,0,6.6c0,2.3,0,4.6,0,6.6
			c0,2.1,0,4.5,0,7.1H227.8z M227.8,160.5v-24.1h4.4c0,2.4,0,4.4,0,6c0,1.6,0,3.6,0,6c0,2.4,0,4.4,0,6c0,1.6,0,3.6,0,6H227.8z
			 M232.2,151.2c0,2.6,0,5,0,7.1c0,2.1,0,4.3,0,6.6c0,2.3,0,4.6,0,6.6c0,2.1,0,4.5,0,7.1c2.7,0,5.1,0,7.2,0c2.1,0,4.4,0,6.7,0
			c2.4,0,4.6,0,6.7,0c2.1,0,4.5,0,7.2,0c0,0.7,0,1.5,0,2.3c0,0.8,0,1.6,0,2.3c-3.1,0-5.9,0-8.3,0c-2.4,0-5.1,0-7.8,0
			c-2.8,0-5.4,0-7.8,0c-2.4,0-5.2,0-8.3,0c0-3.1,0-5.9,0-8.3c0-2.4,0-5,0-7.7c0-2.7,0-5.3,0-7.7c0-2.4,0-5.2,0-8.3H232.2z
			 M259.2,180.9c-1-0.7-1.9-1.4-2.8-2c-0.6-2.7-1.2-5.1-1.7-7.2c-0.5-2.1-1-4.4-1.5-6.7c-0.5-2.4-1-4.6-1.5-6.7
			c-0.5-2.1-1-4.5-1.7-7.2c1.4-0.4,2.7-0.7,4.1-1.1c0.6,2.8,1.2,5.3,1.7,7.5s1,4.5,1.6,7c0.6,2.5,1.1,4.8,1.6,7
			c0.5,2.2,1.1,4.7,1.7,7.5C260.2,179.5,259.7,180.2,259.2,180.9z M259.5,118.2c0.9,0.7,1.9,1.3,2.8,2c0.6,2.7,1.2,5.1,1.7,7.2
			c0.5,2.1,1,4.4,1.5,6.7c0.5,2.4,1,4.6,1.5,6.7c0.5,2.1,1,4.5,1.7,7.2c-1.4,0.3-2.7,0.7-4.1,1.1c-0.6-2.8-1.2-5.3-1.7-7.5
			c-0.5-2.2-1-4.5-1.6-7c-0.6-2.5-1.1-4.8-1.6-7s-1.1-4.7-1.7-7.5C258.5,119.6,259,118.9,259.5,118.2z M286.3,148c0-2.6,0-5,0-7.1
			c0-2.1,0-4.3,0-6.6c0-2.3,0-4.6,0-6.6c0-2.1,0-4.5,0-7.1c-2.7,0-5.1,0-7.2,0c-2.1,0-4.4,0-6.7,0c-2.4,0-4.6,0-6.7,0s-4.5,0-7.2,0
			c0-0.8,0-1.5,0-2.3c0-0.8,0-1.5,0-2.3c3.1,0,5.9,0,8.3,0c2.4,0,5.1,0,7.8,0s5.4,0,7.8,0s5.2,0,8.3,0c0,3.1,0,5.9,0,8.3
			c0,2.4,0,5,0,7.7c0,2.7,0,5.3,0,7.7c0,2.4,0,5.2,0,8.3H286.3z M290.7,151.2c0,3.1,0,5.9,0,8.3c0,2.4,0,5,0,7.7c0,2.7,0,5.3,0,7.7
			c0,2.4,0,5.2,0,8.3c-3.1,0-5.9,0-8.3,0s-5.1,0-7.8,0s-5.4,0-7.8,0c-2.4,0-5.2,0-8.3,0c0-0.8,0-1.5,0-2.3c0-0.8,0-1.5,0-2.3
			c2.7,0,5.1,0,7.2,0s4.4,0,6.7,0c2.4,0,4.6,0,6.7,0c2.1,0,4.5,0,7.2,0c0-2.6,0-5,0-7.1c0-2.1,0-4.3,0-6.6c0-2.3,0-4.6,0-6.6
			c0-2.1,0-4.5,0-7.1H290.7z M290.7,160.5h-4.4c0-2.4,0-4.4,0-6c0-1.6,0-3.6,0-6c0-2.4,0-4.4,0-6c0-1.6,0-3.6,0-6h4.4V160.5z"/>
		<path class="st3" d="M286.3,144.5c0-2.8,0-5.2,0-7.4c0-2.2,0-4.5,0-6.9c0-2.5,0-4.8,0-6.9c0-2.2,0-4.6,0-7.4c2.9,0,5.5,0,7.8,0
			c2.3,0,4.7,0,7.3,0c2.6,0,5,0,7.3,0c2.3,0,4.8,0,7.8,0c0,0.7,0,1.5,0,2.3c0,0.8,0,1.6,0,2.3c-3.5,0-6.5,0-9,0s-5.1,0-7.6,0
			c-2.5,0-5.5,0-9,0c0,3.2,0,6,0,8.4c0,2.4,0,4.8,0,7.2c0,2.4,0,5.2,0,8.4H286.3z M286.3,161.7v-24.1h4.4c0,2.4,0,4.4,0,6s0,3.6,0,6
			s0,4.4,0,6c0,1.6,0,3.6,0,6H286.3z M290.7,154.7c0,3.2,0,6,0,8.4c0,2.4,0,4.8,0,7.2c0,2.4,0,5.2,0,8.4c3.5,0,6.5,0,9,0
			c2.5,0,5.1,0,7.6,0s5.5,0,9,0c0,0.7,0,1.5,0,2.3c0,0.8,0,1.6,0,2.3c-2.9,0-5.5,0-7.8,0c-2.3,0-4.7,0-7.3,0c-2.6,0-5,0-7.3,0
			c-2.3,0-4.8,0-7.8,0c0-2.8,0-5.2,0-7.4c0-2.2,0-4.5,0-6.9c0-2.5,0-4.8,0-6.9c0-2.2,0-4.6,0-7.4H290.7z M340.6,144.5
			c0-3.2,0-6,0-8.4c0-2.4,0-4.8,0-7.2c0-2.4,0-5.2,0-8.4c-3.5,0-6.5,0-9,0s-5.1,0-7.6,0c-2.5,0-5.5,0-9,0c0-0.8,0-1.5,0-2.3
			c0-0.8,0-1.5,0-2.3c2.9,0,5.5,0,7.8,0c2.3,0,4.7,0,7.3,0c2.6,0,5,0,7.3,0c2.3,0,4.8,0,7.8,0c0,2.8,0,5.2,0,7.4c0,2.2,0,4.5,0,6.9
			c0,2.5,0,4.8,0,6.9c0,2.2,0,4.6,0,7.4H340.6z M345.1,154.7c0,2.8,0,5.2,0,7.4c0,2.2,0,4.5,0,6.9c0,2.5,0,4.8,0,6.9
			c0,2.2,0,4.6,0,7.4c-2.9,0-5.5,0-7.8,0c-2.3,0-4.7,0-7.3,0c-2.6,0-5,0-7.3,0c-2.3,0-4.8,0-7.8,0c0-0.8,0-1.5,0-2.3
			c0-0.8,0-1.5,0-2.3c3.5,0,6.5,0,9,0c2.5,0,5.1,0,7.6,0s5.5,0,9,0c0-3.2,0-6,0-8.4c0-2.4,0-4.8,0-7.2c0-2.4,0-5.2,0-8.4H345.1z
			 M319.3,138c0-0.1,0.1-0.1,0.1-0.1c0.1,0,0.2,0,0.3,0c3,0,5.6,0,7.9,0c2.2,0,4.5,0,6.7,0c2.2,0,4.9,0,7.9,0c0.1,0,0.2,0,0.3,0
			c0.1,0,0.1,0.1,0.1,0.1s0,0.2,0,0.3c0,0.5,0,0.9,0,1.3c0,0.4,0,0.7,0,1.1c0,0.4,0,0.8,0,1.3c0,0.2,0,0.4-0.1,0.4
			c0,0-0.2,0.1-0.4,0.1c-3,0-5.6,0-7.9,0c-2.2,0-4.5,0-6.7,0c-2.2,0-4.9,0-7.9,0c-0.1,0-0.2,0-0.3,0c-0.1,0-0.1-0.1-0.1-0.1
			s0-0.2,0-0.3c0-1.2,0-2.5,0-3.7C319.2,138.2,319.2,138.1,319.3,138z M319.2,162c0-1.2,0-2.5,0-3.7c0-0.2,0-0.3,0-0.3
			c0-0.1,0.1-0.1,0.1-0.1c0.1,0,0.2,0,0.3,0c3,0,5.6,0,7.9,0c2.2,0,4.5,0,6.7,0c2.2,0,4.9,0,7.9,0c0.2,0,0.3,0,0.4,0.1
			c0,0,0.1,0.2,0.1,0.4c0,0.5,0,0.9,0,1.3c0,0.4,0,0.7,0,1.1c0,0.4,0,0.8,0,1.3c0,0.2,0,0.3,0,0.3c0,0.1-0.1,0.1-0.1,0.1
			c-0.1,0-0.2,0-0.3,0c-3,0-5.6,0-7.9,0c-2.2,0-4.5,0-6.7,0c-2.2,0-4.9,0-7.9,0c-0.1,0-0.2,0-0.3,0c-0.1,0-0.1-0.1-0.1-0.1
			C319.2,162.3,319.2,162.2,319.2,162z M345.1,172h-4.4c0-6.1,0-12.6,0-19.5v-0.6v-0.6c0-7.6,0-14.8,0-21.8h4.4V172z"/>
	</g>
</g>
<g>
	<g class="st2">
		<path class="st3" d="M162.3,214.6c0.1,1,0.1,2,0.1,3c0,1,0,2,0,3c0,1,0,2-0.1,3c-0.1,1-0.2,1.9-0.3,2.8h-0.7
			c-1-1.4-1.8-2.6-2.5-3.6c-0.7-1-1.4-2-2.2-3c-0.7-1-1.6-2.2-2.5-3.6c-3.4,0-6.8,0-10.1,0c-3.3,0-6.2,0-8.9,0c-2.7,0-5.6,0-8.7,0
			c0,0.3,0,0.9,0,1.8c0,0.8,0,2.2,0,4.1c0,1.9,0,4.6,0,8.1c0,3.5,0,8,0,13.5h-4.8c0-1.4,0-3,0-4.7c0-1.7,0-3.5,0-5.3
			c0-1.9,0-3.8,0-5.7c0-1.9,0-3.9,0-5.8s0-3.8,0-5.6c0-1.8,0-3.5,0-5.1c3.9,0,7.4,0,10.4,0c3.1,0,6.3,0,9.8,0c3.5,0,6.7,0,9.8,0
			c3.1,0,6.5,0,10.4,0C162.2,212.7,162.3,213.6,162.3,214.6z M121.7,257.5v-24.1h4.8c0,2.4,0,4.4,0,6s0,3.6,0,6s0,4.4,0,6
			c0,1.6,0,3.6,0,6H121.7z M126.5,245.9c0,3.9,0,7.2,0,10.1c0,2.8,0,5.7,0,8.5s0,6.2,0,10.1c3.5,0,6.7,0,9.5,0c2.8,0,5.8,0,8.9,0
			c3.1,0,6.1,0,8.9,0c2.8,0,6,0,9.5,0c0,0.8,0,1.6,0,2.3c0,0.7,0,1.4,0,2.3c-0.2,0-1.3,0-3.4,0c-2.1,0-4.7,0-7.9,0
			c-3.2,0-6.5,0-10,0c-3.5,0-6.8,0-9.9,0c-3.1,0-6.6,0-10.5,0c0-3.2,0-6,0-8.6s0-5.2,0-8s0-5.5,0-8.1c0-2.5,0-5.4,0-8.6H126.5z
			 M154.6,276.6c-1-0.7-2-1.4-3-2.1c-0.6-2.7-1.1-5.1-1.6-7.2c-0.5-2.1-1-4.4-1.6-6.8c-0.6-2.4-1.1-4.6-1.6-6.8
			c-0.5-2.1-1-4.5-1.6-7.2c1.5-0.3,3-0.7,4.5-1c0.6,2.8,1.2,5.3,1.7,7.5c0.5,2.2,1,4.5,1.6,7c0.6,2.5,1.1,4.8,1.6,7
			c0.5,2.2,1.1,4.7,1.7,7.5C155.8,275.2,155.2,275.9,154.6,276.6z M202.6,245.9c0,3.2,0,6,0,8.6c0,2.5,0,5.2,0,8.1s0,5.5,0,8
			s0,5.4,0,8.6c-3.9,0-7.4,0-10.5,0c-3.1,0-6.4,0-9.9,0c-3.5,0-6.8,0-10,0c-3.2,0-5.8,0-7.8,0c-2.1,0-3.2,0-3.4,0c0-0.9,0-1.7,0-2.3
			c0-0.7,0-1.4,0-2.3c3.5,0,6.7,0,9.5,0c2.8,0,5.8,0,8.9,0s6.1,0,8.9,0c2.8,0,6,0,9.5,0c0-3.9,0-7.2,0-10.1s0-5.7,0-8.5
			c0-2.8,0-6.2,0-10.1H202.6z M162.1,211.7c3.9,0,7.4,0,10.4,0c3.1,0,6.3,0,9.8,0c3.5,0,6.7,0,9.8,0c3.1,0,6.5,0,10.4,0
			c0,1.6,0,3.3,0,5.1c0,1.8,0,3.7,0,5.6s0,3.8,0,5.8c0,1.9,0,3.8,0,5.7c0,1.9,0,3.6,0,5.3c0,1.7,0,3.2,0,4.7h-4.8c0-5.5,0-10,0-13.5
			c0-3.5,0-6.2,0-8.1c0-1.9,0-3.3,0-4.1c0-0.8,0-1.4,0-1.8c-3.1,0-6,0-8.7,0c-2.7,0-5.6,0-8.9,0c-3.3,0-6.6,0-10.1,0
			c-1,1.4-1.8,2.6-2.5,3.6c-0.7,1-1.4,2-2.2,3c-0.7,1-1.6,2.2-2.5,3.6h-0.7c-0.1-0.9-0.2-1.9-0.3-2.8c-0.1-1-0.1-2-0.1-3
			c0-1,0-2,0-3c0-1,0.1-2,0.1-3C162,213.6,162,212.7,162.1,211.7z M169.8,267c0.5-2.2,1-4.5,1.6-7c0.6-2.5,1.1-4.8,1.6-7
			c0.5-2.2,1.1-4.7,1.7-7.5c1.5,0.3,3,0.7,4.5,1c-0.6,2.7-1.1,5.1-1.6,7.2c-0.5,2.1-1,4.4-1.6,6.8c-0.6,2.4-1.1,4.6-1.6,6.8
			c-0.5,2.1-1,4.5-1.6,7.2c-1,0.7-2,1.4-3,2.1c-0.6-0.7-1.1-1.4-1.7-2.1C168.7,271.7,169.2,269.2,169.8,267z M202.6,257.5h-4.8
			c0-2.4,0-4.4,0-6c0-1.6,0-3.6,0-6s0-4.4,0-6s0-3.6,0-6h4.8V257.5z"/>
		<path class="st3" d="M197.7,243.8c0-3.1,0-5.9,0-8.3c0-2.4,0-5,0-7.7c0-2.7,0-5.3,0-7.7c0-2.4,0-5.2,0-8.3c3.3,0,6.2,0,8.8,0
			c2.6,0,5.3,0,8.2,0c2.9,0,5.7,0,8.4,0c2.7,0,4.9,0,6.7,0c1.8,0,2.9,0,3.1,0c0,0.7,0,1.5,0,2.3c0,0.8,0,1.6,0,2.3
			c-2.8,0-5.2,0-7.2,0s-4.1,0-6.2,0s-4.5,0-7.2,0c-0.1,0-0.5,0.3-1.2,0.9c-0.7,0.6-1.5,1.3-2.5,2.2c-1,0.9-1.9,1.8-2.8,2.7
			c-0.9,0.9-1.7,1.7-2.3,2.3c-0.6,0.7-0.9,1-0.9,1.2v18.3H197.7z M197.7,257.5v-24.1h4.8c0,2.4,0,4.4,0,6s0,3.6,0,6s0,4.4,0,6
			c0,1.6,0,3.6,0,6H197.7z M202.6,247.1v18.3c0,0.1,0.3,0.5,0.9,1.1c0.6,0.7,1.4,1.4,2.3,2.3c0.9,0.9,1.9,1.8,2.8,2.7
			c1,0.9,1.8,1.6,2.5,2.2c0.7,0.6,1.1,0.9,1.2,0.9c2.8,0,5.2,0,7.2,0s4.1,0,6.2,0s4.5,0,7.2,0c0,0.7,0,1.5,0,2.3c0,0.8,0,1.6,0,2.3
			c-0.3,0-1.3,0-3.1,0c-1.8,0-4.1,0-6.7,0c-2.7,0-5.5,0-8.4,0c-2.9,0-5.7,0-8.2,0c-2.6,0-5.5,0-8.8,0c0-3.1,0-5.9,0-8.3
			c0-2.4,0-5,0-7.7c0-2.7,0-5.3,0-7.7c0-2.4,0-5.2,0-8.3H202.6z M229.7,241.2c0-1.3,0-2.7,0-4c0-1.3,0-2.9,0-4.8c0-0.2,0-0.3,0-0.3
			c0-0.1,0.1-0.1,0.1-0.1c0.1,0,0.2,0,0.3,0c0.4,0,0.9,0,1.3,0c0.4,0,0.8,0,1.3,0c0.4,0,0.9,0,1.3,0c0.2,0,0.3,0,0.3,0
			c0.1,0,0.1,0.1,0.1,0.1c0,0.1,0,0.2,0,0.3c0,1.8,0,3.4,0,4.8c0,1.3,0,2.7,0,4c0,1.3,0,2.9,0,4.8c0,1.2,0,2.2,0,3.2
			c0,0.9,0,1.9,0,2.9c0,1,0,2,0,2.9s0,2,0,3.2c0,0.2,0,0.3,0,0.3c0,0.1-0.1,0.1-0.1,0.1c-0.1,0-0.2,0-0.3,0c-0.6,0-1.3,0-1.9,0
			c-0.6,0-1.3,0-2,0c-0.2,0-0.3,0-0.3,0c-0.1,0-0.1-0.1-0.1-0.1c0-0.1,0-0.2,0-0.3c0-1.2,0-2.2,0-3.2s0-1.9,0-2.9c0-1,0-2,0-2.9
			c0-0.9,0-2,0-3.2C229.7,244.2,229.7,242.6,229.7,241.2z M261.7,243.8v-18.3c0-0.1-0.3-0.5-0.9-1.2c-0.6-0.7-1.4-1.4-2.3-2.3
			c-0.9-0.9-1.9-1.8-2.8-2.7c-1-0.9-1.8-1.6-2.5-2.2c-0.7-0.6-1.1-0.9-1.2-0.9c-2.8,0-5.2,0-7.2,0s-4.1,0-6.2,0s-4.5,0-7.2,0
			c0-0.8,0-1.5,0-2.3c0-0.8,0-1.5,0-2.3c0.3,0,1.3,0,3.1,0c1.8,0,4.1,0,6.7,0c2.7,0,5.5,0,8.4,0c2.9,0,5.7,0,8.2,0
			c2.6,0,5.5,0,8.8,0c0,3.1,0,5.9,0,8.3c0,2.4,0,5,0,7.7c0,2.7,0,5.3,0,7.7c0,2.4,0,5.2,0,8.3H261.7z M266.6,247.1
			c0,3.1,0,5.9,0,8.3c0,2.4,0,5,0,7.7c0,2.7,0,5.3,0,7.7c0,2.4,0,5.2,0,8.3c-3.3,0-6.2,0-8.8,0c-2.6,0-5.3,0-8.2,0
			c-2.9,0-5.7,0-8.4,0c-2.7,0-4.9,0-6.7,0c-1.8,0-2.9,0-3.1,0c0-0.8,0-1.5,0-2.3c0-0.8,0-1.5,0-2.3c2.8,0,5.2,0,7.2,0s4.1,0,6.2,0
			s4.5,0,7.2,0c0.1,0,0.5-0.3,1.2-0.9c0.7-0.6,1.5-1.3,2.5-2.2s1.9-1.8,2.8-2.7c0.9-0.9,1.7-1.7,2.3-2.3c0.6-0.7,0.9-1,0.9-1.1
			v-18.3H266.6z M266.6,257.5h-4.8c0-2.4,0-4.4,0-6c0-1.6,0-3.6,0-6s0-4.4,0-6s0-3.6,0-6h4.8V257.5z"/>
		<path class="st3" d="M261.7,243.8c0-3.1,0-5.9,0-8.3c0-2.4,0-5,0-7.7c0-2.7,0-5.3,0-7.7c0-2.4,0-5.2,0-8.3c3.4,0,6.4,0,9.1,0
			c2.7,0,5.5,0,8.5,0c3,0,5.9,0,8.5,0c2.7,0,5.7,0,9.1,0c0,0.7,0,1.5,0,2.3c0,0.8,0,1.6,0,2.3c-2.9,0-5.6,0-7.9,0s-4.8,0-7.3,0
			c-2.6,0-5,0-7.3,0c-2.3,0-4.9,0-7.9,0c0,2.6,0,5,0,7.1c0,2.1,0,4.3,0,6.6c0,2.3,0,4.6,0,6.6c0,2.1,0,4.5,0,7.1H261.7z
			 M261.7,257.5v-24.1h4.8c0,2.4,0,4.4,0,6s0,3.6,0,6s0,4.4,0,6c0,1.6,0,3.6,0,6H261.7z M266.6,247.1c0,2.6,0,5,0,7.1
			c0,2.1,0,4.3,0,6.6c0,2.3,0,4.6,0,6.6c0,2.1,0,4.5,0,7.1c2.9,0,5.6,0,7.9,0c2.3,0,4.8,0,7.3,0c2.6,0,5,0,7.3,0s4.9,0,7.9,0
			c0,0.7,0,1.5,0,2.3c0,0.8,0,1.6,0,2.3c-3.4,0-6.4,0-9.1,0c-2.7,0-5.5,0-8.5,0c-3,0-5.9,0-8.5,0c-2.7,0-5.7,0-9.1,0
			c0-3.1,0-5.9,0-8.3c0-2.4,0-5,0-7.7c0-2.7,0-5.3,0-7.7c0-2.4,0-5.2,0-8.3H266.6z M293.7,238c0-1.9,0-4.3,0-7.1
			c0-0.2,0-0.4,0.1-0.4c0,0,0.2-0.1,0.4-0.1c0.4,0,0.9,0,1.3,0c0.4,0,0.8,0,1.3,0s0.9,0,1.3,0c0.2,0,0.4,0,0.4,0.1
			c0,0,0.1,0.2,0.1,0.4c0,2.9,0,5.3,0,7.1c0,1.9,0,4.3,0,7.1c0,0.2,0,0.4-0.1,0.4c0,0-0.2,0.1-0.4,0.1c-0.6,0-1.3,0-1.9,0
			c-0.6,0-1.3,0-2,0c-0.2,0-0.4,0-0.4-0.1c0,0-0.1-0.2-0.1-0.4C293.7,242.2,293.7,239.8,293.7,238z M293.7,254.6c0.5,0,0.9,0,1.3,0
			s0.7,0,1.1,0c0.4,0,0.9,0,1.2,0c0.4,0,0.8,0,1.3,0c0,0.6,0,1.7,0,3.2c0,1.5,0,3.2,0,5.1c0,1.9,0,3.7,0,5.5s0,3.8,0,6.1
			c2.6,0,5,0,7,0s4.2,0,6.5,0s4.5,0,6.5,0s4.4,0,7,0c0-2.4,0-4.3,0-5.7c0-1.4,0-2.4,0-2.9c0-0.4,0-0.8,0-1.2s0-0.9,0-1.5
			c0-0.6,0-1.4,0-2.3s0-2.1,0-3.5c0-1.6,0-3,0-4s0-2.4,0-4h4.8c0,1.9,0,4,0,6.2c0,2.3,0,4.7,0,7.2c0,2.5,0,5.2,0,7.9
			c0,2.7,0,5.5,0,8.4c-3.5,0-6.6,0-9.3,0c-2.7,0-5.7,0-8.8,0c-3.1,0-6,0-8.8,0c-2.8,0-5.1,0-6.9,0c-1.8,0-2.8,0-3,0
			c0-0.9,0-1.7,0-2.3s0-1.4,0-2.3c0-1.5,0-3.1,0-4.6s0-3,0-4.4s0-2.8,0-4.1c0-1.3,0-2.5,0-3.7C293.7,256.6,293.7,255.6,293.7,254.6z
			 M325.7,243.8v-18.3c0-0.1-0.3-0.5-0.9-1.2c-0.6-0.7-1.4-1.4-2.3-2.3c-0.9-0.9-1.9-1.8-2.8-2.7c-1-0.9-1.8-1.6-2.5-2.2
			c-0.7-0.6-1.1-0.9-1.2-0.9c-2.8,0-5.2,0-7.2,0s-4.1,0-6.2,0s-4.5,0-7.2,0c0-0.8,0-1.5,0-2.3c0-0.8,0-1.5,0-2.3c0.3,0,1.3,0,3.1,0
			s4.1,0,6.7,0s5.5,0,8.4,0c2.9,0,5.7,0,8.2,0c2.6,0,5.5,0,8.8,0c0,3.1,0,5.9,0,8.3c0,2.4,0,5,0,7.7c0,2.7,0,5.3,0,7.7
			c0,2.4,0,5.2,0,8.3H325.7z M321.5,243.8c1.1-0.9,2.5-2,4.2-3.3v-5.8h2.3h2.5c0,3.3,0,6.2,0,8.6c0,2.5,0,4.9,0,7.4
			c0,2.5,0,5.3,0,8.6H328h-2.3v-5.8c-1.7-1.3-3.1-2.4-4.2-3.3c-1.1-0.9-2.5-2-4.2-3.3C319,245.8,320.4,244.7,321.5,243.8z"/>
		<path class="st3" d="M325.7,240.4c0-2.8,0-5.2,0-7.4c0-2.2,0-4.5,0-6.9c0-2.5,0-4.8,0-6.9c0-2.2,0-4.6,0-7.4c3.2,0,6,0,8.5,0
			c2.5,0,5.1,0,7.9,0s5.5,0,7.9,0s5.3,0,8.5,0c0,0.7,0,1.5,0,2.3c0,0.8,0,1.6,0,2.3c-3.8,0-7.1,0-9.8,0s-5.6,0-8.3,0s-6.1,0-9.8,0
			c0,3.2,0,6,0,8.4c0,2.4,0,4.8,0,7.2c0,2.4,0,5.2,0,8.4H325.7z M325.7,257.5v-24.1h4.8c0,2.4,0,4.4,0,6s0,3.6,0,6s0,4.4,0,6
			c0,1.6,0,3.6,0,6H325.7z M330.6,250.5c0,3.2,0,6,0,8.4s0,4.8,0,7.2s0,5.2,0,8.4c3.8,0,7.1,0,9.8,0s5.6,0,8.3,0s6.1,0,9.8,0
			c0,0.7,0,1.5,0,2.3c0,0.8,0,1.6,0,2.3c-3.2,0-6,0-8.5,0s-5.1,0-7.9,0s-5.5,0-7.9,0c-2.5,0-5.3,0-8.5,0c0-2.8,0-5.2,0-7.4
			c0-2.2,0-4.5,0-6.9s0-4.8,0-6.9c0-2.2,0-4.6,0-7.4H330.6z M385.1,240.4c0-3.2,0-6,0-8.4c0-2.4,0-4.8,0-7.2c0-2.4,0-5.2,0-8.4
			c-3.8,0-7.1,0-9.8,0c-2.8,0-5.6,0-8.3,0s-6.1,0-9.8,0c0-0.8,0-1.5,0-2.3c0-0.8,0-1.5,0-2.3c3.2,0,6,0,8.5,0s5.1,0,7.9,0
			c2.8,0,5.5,0,7.9,0c2.5,0,5.3,0,8.5,0c0,2.8,0,5.2,0,7.4c0,2.2,0,4.5,0,6.9c0,2.5,0,4.8,0,6.9c0,2.2,0,4.6,0,7.4H385.1z
			 M390,250.5c0,2.8,0,5.2,0,7.4c0,2.2,0,4.5,0,6.9s0,4.8,0,6.9c0,2.2,0,4.6,0,7.4c-3.2,0-6,0-8.5,0c-2.5,0-5.1,0-7.9,0
			c-2.8,0-5.5,0-7.9,0s-5.3,0-8.5,0c0-0.8,0-1.5,0-2.3c0-0.8,0-1.5,0-2.3c3.8,0,7.1,0,9.8,0s5.6,0,8.3,0c2.8,0,6.1,0,9.8,0
			c0-3.2,0-6,0-8.4s0-4.8,0-7.2s0-5.2,0-8.4H390z M361.7,233.9c0-0.1,0.1-0.1,0.1-0.1c0.1,0,0.2,0,0.3,0c3.3,0,6.2,0,8.6,0
			c2.5,0,4.9,0,7.4,0s5.3,0,8.6,0c0.2,0,0.3,0,0.3,0c0.1,0,0.1,0.1,0.1,0.1c0,0.1,0,0.2,0,0.3c0,0.5,0,0.9,0,1.3c0,0.4,0,0.7,0,1.1
			c0,0.4,0,0.8,0,1.3c0,0.2,0,0.4-0.1,0.4c0,0-0.2,0.1-0.4,0.1c-3.3,0-6.2,0-8.6,0s-4.9,0-7.4,0c-2.5,0-5.3,0-8.6,0
			c-0.2,0-0.3,0-0.3,0c-0.1,0-0.1-0.1-0.1-0.1c0-0.1,0-0.2,0-0.3c0-1.2,0-2.5,0-3.7C361.7,234,361.7,233.9,361.7,233.9z
			 M361.7,257.9c0-1.2,0-2.5,0-3.7c0-0.2,0-0.3,0-0.3c0-0.1,0.1-0.1,0.1-0.1c0.1,0,0.2,0,0.3,0c3.3,0,6.2,0,8.6,0c2.5,0,4.9,0,7.4,0
			s5.3,0,8.6,0c0.2,0,0.4,0,0.4,0.1c0,0,0.1,0.2,0.1,0.4c0,0.5,0,0.9,0,1.3s0,0.7,0,1.1s0,0.8,0,1.3c0,0.2,0,0.3,0,0.3
			c0,0.1-0.1,0.1-0.1,0.1c-0.1,0-0.2,0-0.3,0c-3.3,0-6.2,0-8.6,0s-4.9,0-7.4,0c-2.5,0-5.3,0-8.6,0c-0.2,0-0.3,0-0.3,0
			c-0.1,0-0.1-0.1-0.1-0.1C361.7,258.1,361.7,258,361.7,257.9z M390,267.9h-4.8c0-6.1,0-12.6,0-19.6v-0.6v-0.6c0-7.6,0-14.8,0-21.8
			h4.8V267.9z"/>
	</g>
</g>
<g>
	<g class="st2">
		<path class="st3" d="M103,342c0-3.1,0-5.9,0-8.3s0-5,0-7.7c0-2.7,0-5.3,0-7.7c0-2.4,0-5.2,0-8.3c3.2,0,6.1,0,8.7,0s5.3,0,8.1,0
			s5.6,0,8.1,0c2.5,0,5.4,0,8.7,0c0,0.7,0,1.5,0,2.3c0,0.8,0,1.6,0,2.3c-2.8,0-5.3,0-7.5,0c-2.2,0-4.5,0-7,0c-2.5,0-4.8,0-7,0
			c-2.2,0-4.7,0-7.5,0c0,2.6,0,5,0,7.1c0,2.1,0,4.3,0,6.6c0,2.3,0,4.6,0,6.6c0,2.1,0,4.5,0,7.1H103z M103,332.3h4.6
			c0,1.5,0,3.1,0,4.6c0,1.5,0,3,0,4.5s0,3,0,4.5c0,1.5,0,3,0,4.6c0.4,0,0.8,0,1.2,0c0.4,0,0.9,0,1.4,0c0.5,0,1,0,1.6,0
			c0.5,0,1.1,0,1.7,0s1.1,0,1.7,0c0.5,0,1.1,0,1.6,0c0.5,0,1,0,1.4,0c0.4,0,0.9,0,1.2,0c0.2-1.3,0.3-2.7,0.5-4.3
			c0.2-1.6,0.4-3.2,0.5-4.8c0.2-1.6,0.3-3.1,0.5-4.4c0.2-1.3,0.3-2.8,0.5-4.5c0.7,0,1.5,0,2.2,0c0.7,0,1.5,0,2.2,0
			c-0.2,2.2-0.3,4.4-0.5,6.7c-0.2,2.2-0.3,4.5-0.4,6.7c-0.1,2.2-0.3,4.5-0.4,6.7c-0.2,2.2-0.3,4.5-0.4,6.7c-0.1,2.2-0.3,4.5-0.4,6.7
			c-0.2,2.2-0.3,4.4-0.5,6.7c2.8,0,5.1,0,7,0s4.2,0,7,0c0,0.7,0,1.5,0,2.3c0,0.8,0,1.6,0,2.3c-2.7,0-5.4,0-8,0c-2.7,0-5.4,0-8.1,0
			c-2.8,0-5.6,0-8.5,0s-6,0-9.2,0V332.3z M168.5,377.3c-3.2,0-6.3,0-9.2,0c-2.9,0-5.8,0-8.5,0c-2.8,0-5.5,0-8.1,0c-2.7,0-5.3,0-8,0
			c0-0.8,0-1.5,0-2.3c0-0.8,0-1.5,0-2.3c2.8,0,5.1,0,7,0c1.8,0,4.2,0,7,0c-0.2-2.2-0.3-4.4-0.5-6.7c-0.2-2.2-0.3-4.5-0.4-6.7
			c-0.1-2.2-0.3-4.5-0.4-6.7c-0.2-2.2-0.3-4.5-0.4-6.7c-0.1-2.2-0.3-4.5-0.4-6.7c-0.2-2.2-0.3-4.4-0.5-6.7c0.7,0,1.5,0,2.2,0
			c0.7,0,1.5,0,2.2,0c0.2,1.6,0.3,3.1,0.5,4.5c0.2,1.3,0.3,2.8,0.5,4.4c0.2,1.6,0.3,3.2,0.5,4.8c0.2,1.6,0.4,3,0.5,4.3
			c0.4,0,0.8,0,1.2,0c0.4,0,0.9,0,1.4,0c0.5,0,1,0,1.6,0c0.5,0,1.1,0,1.7,0c0.6,0,1.1,0,1.7,0c0.5,0,1.1,0,1.6,0c0.5,0,1,0,1.4,0
			c0.4,0,0.9,0,1.2,0c0-1.5,0-3.1,0-4.6c0-1.5,0-3,0-4.5s0-3,0-4.5c0-1.5,0-3,0-4.6h4.6V377.3z M163.9,342c0-2.6,0-5,0-7.1
			c0-2.1,0-4.3,0-6.6c0-2.3,0-4.6,0-6.6c0-2.1,0-4.5,0-7.1c-2.8,0-5.3,0-7.5,0c-2.2,0-4.5,0-7,0c-2.5,0-4.8,0-7,0
			c-2.2,0-4.7,0-7.5,0c0-0.8,0-1.5,0-2.3c0-0.8,0-1.5,0-2.3c3.2,0,6.1,0,8.7,0c2.5,0,5.3,0,8.1,0s5.6,0,8.1,0c2.5,0,5.4,0,8.7,0
			c0,3.1,0,5.9,0,8.3c0,2.4,0,5,0,7.7c0,2.7,0,5.3,0,7.7s0,5.2,0,8.3H163.9z"/>
		<path class="st3" d="M163.9,342c0-3.1,0-5.9,0-8.3s0-5,0-7.7c0-2.7,0-5.3,0-7.7c0-2.4,0-5.2,0-8.3c3.2,0,6.1,0,8.7,0s5.3,0,8.1,0
			s5.6,0,8.1,0c2.5,0,5.4,0,8.7,0c0,0.7,0,1.5,0,2.3c0,0.8,0,1.6,0,2.3c-2.8,0-5.3,0-7.5,0c-2.2,0-4.5,0-7,0c-2.5,0-4.8,0-7,0
			c-2.2,0-4.7,0-7.5,0c0,2.6,0,5,0,7.1c0,2.1,0,4.3,0,6.6c0,2.3,0,4.6,0,6.6c0,2.1,0,4.5,0,7.1H163.9z M163.9,355.7v-24.1h4.6
			c0,2.4,0,4.4,0,6s0,3.6,0,6s0,4.4,0,6c0,1.6,0,3.6,0,6H163.9z M168.5,345.2c0,2.6,0,5,0,7.1c0,2.1,0,4.3,0,6.6c0,2.3,0,4.6,0,6.6
			c0,2.1,0,4.5,0,7.1c2.8,0,5.3,0,7.5,0c2.2,0,4.5,0,7,0c2.5,0,4.8,0,7,0c2.2,0,4.7,0,7.5,0c0,0.7,0,1.5,0,2.3c0,0.8,0,1.6,0,2.3
			c-3.2,0-6.1,0-8.7,0c-2.5,0-5.3,0-8.1,0s-5.6,0-8.1,0s-5.4,0-8.7,0c0-3.1,0-5.9,0-8.3c0-2.4,0-5,0-7.7c0-2.7,0-5.3,0-7.7
			c0-2.4,0-5.2,0-8.3H168.5z M194.4,336.1c0-1.9,0-4.3,0-7.1c0-0.2,0-0.4,0.1-0.4c0,0,0.2-0.1,0.4-0.1c0.4,0,0.8,0,1.2,0
			c0.4,0,0.8,0,1.2,0c0.4,0,0.8,0,1.2,0c0.2,0,0.4,0,0.4,0.1c0,0,0.1,0.2,0.1,0.4c0,2.9,0,5.3,0,7.1c0,1.9,0,4.3,0,7.1
			c0,0.2,0,0.4-0.1,0.4c0,0-0.2,0.1-0.4,0.1c-0.6,0-1.2,0-1.8,0c-0.6,0-1.2,0-1.9,0c-0.2,0-0.4,0-0.4-0.1c0,0-0.1-0.2-0.1-0.4
			C194.4,340.4,194.4,338,194.4,336.1z M194.4,352.8c0.5,0,0.9,0,1.2,0c0.3,0,0.7,0,1.1,0c0.4,0,0.8,0,1.2,0c0.4,0,0.8,0,1.2,0
			c0,0.6,0,1.7,0,3.2c0,1.5,0,3.2,0,5.1c0,1.9,0,3.7,0,5.5s0,3.8,0,6.1c2.5,0,4.7,0,6.7,0s4,0,6.2,0s4.3,0,6.2,0s4.2,0,6.7,0
			c0-2.4,0-4.3,0-5.7c0-1.4,0-2.4,0-2.9c0-0.4,0-0.8,0-1.2s0-0.9,0-1.5c0-0.6,0-1.4,0-2.3s0-2.1,0-3.5c0-1.6,0-3,0-4s0-2.4,0-4h4.6
			c0,1.9,0,4,0,6.2c0,2.3,0,4.7,0,7.2c0,2.5,0,5.2,0,7.9c0,2.7,0,5.5,0,8.4c-3.3,0-6.2,0-8.9,0c-2.6,0-5.4,0-8.3,0c-3,0-5.8,0-8.4,0
			c-2.7,0-4.9,0-6.6,0c-1.7,0-2.7,0-2.8,0c0-0.9,0-1.7,0-2.3s0-1.4,0-2.3c0-1.5,0-3.1,0-4.6s0-3,0-4.4s0-2.8,0-4.1
			c0-1.3,0-2.5,0-3.7C194.4,354.8,194.4,353.7,194.4,352.8z M224.9,342v-18.3c0-0.1-0.3-0.5-0.9-1.2c-0.6-0.7-1.3-1.4-2.2-2.3
			c-0.9-0.9-1.8-1.8-2.7-2.7c-0.9-0.9-1.7-1.6-2.4-2.2c-0.7-0.6-1-0.9-1.1-0.9c-2.6,0-4.9,0-6.9,0s-3.9,0-5.9,0c-2,0-4.3,0-6.9,0
			c0-0.8,0-1.5,0-2.3c0-0.8,0-1.5,0-2.3c0.3,0,1.3,0,3,0c1.7,0,3.9,0,6.4,0c2.5,0,5.2,0,8,0c2.8,0,5.4,0,7.8,0c2.5,0,5.2,0,8.3,0
			c0,3.1,0,5.9,0,8.3c0,2.4,0,5,0,7.7c0,2.7,0,5.3,0,7.7s0,5.2,0,8.3H224.9z M220.8,341.9c1.1-0.9,2.4-2,4-3.3v-5.8h2.2h2.4
			c0,3.3,0,6.2,0,8.6s0,4.9,0,7.4c0,2.5,0,5.3,0,8.6h-2.4h-2.2v-5.8c-1.6-1.3-3-2.4-4-3.3c-1.1-0.9-2.4-2-4-3.3
			C218.4,343.9,219.8,342.8,220.8,341.9z"/>
		<path class="st3" d="M224.9,342c0-3.1,0-5.9,0-8.3s0-5,0-7.7c0-2.7,0-5.3,0-7.7c0-2.4,0-5.2,0-8.3c3.1,0,5.9,0,8.3,0
			c2.5,0,5.1,0,7.8,0c2.8,0,5.4,0,8,0c2.5,0,4.7,0,6.4,0c1.7,0,2.7,0,3,0c0,0.7,0,1.5,0,2.3c0,0.8,0,1.6,0,2.3c-2.6,0-4.9,0-6.9,0
			s-3.9,0-5.9,0s-4.3,0-6.9,0c-0.1,0-0.5,0.3-1.2,0.9c-0.7,0.6-1.4,1.3-2.4,2.2s-1.8,1.8-2.7,2.7c-0.9,0.9-1.6,1.7-2.2,2.3
			c-0.6,0.7-0.9,1-0.9,1.2V342H224.9z M224.9,355.7v-24.1h4.6c0,2.4,0,4.4,0,6s0,3.6,0,6s0,4.4,0,6c0,1.6,0,3.6,0,6H224.9z
			 M229.5,345.2c0,2.6,0,5,0,7.1c0,2.1,0,4.3,0,6.6c0,2.3,0,4.6,0,6.6c0,2.1,0,4.5,0,7.1c2.8,0,5.3,0,7.5,0c2.2,0,4.5,0,7,0
			c2.5,0,4.8,0,7,0c2.2,0,4.7,0,7.5,0c0,0.7,0,1.5,0,2.3c0,0.8,0,1.6,0,2.3c-3.2,0-6.1,0-8.7,0c-2.5,0-5.3,0-8.1,0s-5.6,0-8.1,0
			s-5.4,0-8.7,0c0-3.1,0-5.9,0-8.3c0-2.4,0-5,0-7.7c0-2.7,0-5.3,0-7.7c0-2.4,0-5.2,0-8.3H229.5z M255.5,338.6c0-1.9,0-4.3,0-7.1
			c0-0.2,0-0.4,0.1-0.4c0,0,0.2-0.1,0.4-0.1c0.4,0,0.8,0,1.2,0s0.8,0,1.2,0s0.8,0,1.2,0c0.2,0,0.4,0,0.4,0.1c0,0,0.1,0.2,0.1,0.4
			c0,2.9,0,5.3,0,7.1s0,4.3,0,7.1c0,0.2,0,0.4-0.1,0.4c0,0-0.2,0.1-0.4,0.1c-0.6,0-1.2,0-1.8,0c-0.6,0-1.2,0-1.9,0
			c-0.2,0-0.4,0-0.4-0.1c0,0-0.1-0.2-0.1-0.4C255.5,342.9,255.5,340.5,255.5,338.6z M260.1,356.9c0.1,0,0.1,0.1,0.1,0.1s0,0.2,0,0.3
			c0,2.1,0,3.9,0,5.4c0,1.5,0,3.1,0,4.6s0,3.3,0,5.4c0,0.1,0,0.2,0,0.3c0,0.1,0,0.1-0.1,0.1c0,0-0.1,0.1-0.1,0.1c-0.1,0-0.1,0-0.3,0
			c-1.2,0-2.5,0-3.7,0c-0.1,0-0.2,0-0.3,0s-0.1,0-0.1-0.1s-0.1-0.1-0.1-0.1c0-0.1,0-0.1,0-0.3c0-2.1,0-3.9,0-5.4s0-3.1,0-4.6
			c0-1.5,0-3.3,0-5.4c0-0.2,0-0.3,0-0.3c0-0.1,0.1-0.1,0.1-0.1c0.1,0,0.2,0,0.3,0c1.2,0,2.5,0,3.7,0
			C260,356.8,260.1,356.8,260.1,356.9z M285.8,342v-18.3c0-0.1-0.3-0.5-0.9-1.2c-0.6-0.7-1.3-1.4-2.2-2.3c-0.9-0.9-1.8-1.8-2.7-2.7
			c-0.9-0.9-1.7-1.6-2.4-2.2c-0.7-0.6-1-0.9-1.1-0.9c-2.6,0-4.9,0-6.9,0s-3.9,0-5.9,0c-2,0-4.3,0-6.9,0c0-0.8,0-1.5,0-2.3
			c0-0.8,0-1.5,0-2.3c0.3,0,1.3,0,3,0c1.7,0,3.9,0,6.4,0c2.5,0,5.2,0,8,0s5.4,0,7.8,0s5.2,0,8.3,0c0,3.1,0,5.9,0,8.3
			c0,2.4,0,5,0,7.7c0,2.7,0,5.3,0,7.7s0,5.2,0,8.3H285.8z M290.4,345.2c0,3.1,0,5.9,0,8.3c0,2.4,0,5,0,7.7c0,2.7,0,5.3,0,7.7
			c0,2.4,0,5.2,0,8.3c-3.2,0-6.1,0-8.7,0c-2.5,0-5.3,0-8.1,0s-5.6,0-8.1,0c-2.5,0-5.4,0-8.7,0c0-0.8,0-1.5,0-2.3c0-0.8,0-1.5,0-2.3
			c2.8,0,5.3,0,7.5,0c2.2,0,4.5,0,7,0c2.5,0,4.8,0,7,0c2.2,0,4.7,0,7.5,0c0-2.6,0-5,0-7.1c0-2.1,0-4.3,0-6.6c0-2.3,0-4.6,0-6.6
			c0-2.1,0-4.5,0-7.1H290.4z M290.4,355.7h-4.6c0-2.4,0-4.4,0-6c0-1.6,0-3.6,0-6s0-4.4,0-6s0-3.6,0-6h4.6V355.7z"/>
		<path class="st3" d="M285.8,342c0-1.8,0-3.8,0-6c0-2.2,0-4.5,0-7s0-4.8,0-7c0-2.3,0-4.3,0-6.2s0-3.8,0-6c3,0,5.7,0,8.1,0
			s4.9,0,7.6,0s5.2,0,7.6,0s5,0,8.1,0c0,0.7,0,1.5,0,2.3c0,0.8,0,1.6,0,2.3c-0.2,0-0.8,0-1.9,0c-1.1,0-2.4,0-3.9,0
			c-1.6,0-3.1,0-4.7,0s-3,0-4.3,0c-1.2,0-2.1,0-2.6,0c-0.1,0-0.5,0.3-1.2,0.9c-0.7,0.6-1.4,1.3-2.4,2.2s-1.8,1.8-2.7,2.7
			c-0.9,0.9-1.6,1.7-2.2,2.3c-0.6,0.7-0.9,1-0.9,1.2V342H285.8z M285.8,355.7v-24.1h4.6c0,2.4,0,4.4,0,6s0,3.6,0,6s0,4.4,0,6
			c0,1.6,0,3.6,0,6H285.8z M285.8,345.2h4.6v18.3c0,0.1,0.3,0.5,0.9,1.1c0.6,0.7,1.3,1.4,2.2,2.3c0.9,0.9,1.8,1.8,2.7,2.7
			s1.7,1.6,2.4,2.2c0.7,0.6,1,0.9,1.2,0.9c0.5,0,1.3,0,2.6,0c1.2,0,2.7,0,4.3,0s3.2,0,4.7,0c1.6,0,2.9,0,3.9,0c1.1,0,1.7,0,1.9,0
			c0,0.7,0,1.5,0,2.3c0,0.8,0,1.6,0,2.3c-3,0-5.7,0-8.1,0s-4.9,0-7.6,0s-5.2,0-7.6,0s-5.1,0-8.1,0c0-2.1,0-4.1,0-6
			c0-1.8,0-3.9,0-6.2c0-2.3,0-4.6,0-7c0-2.4,0-4.7,0-7C285.8,348.9,285.8,346.9,285.8,345.2z M342.4,338.6c0-3.2,0-6,0-8.4
			c0-2.4,0-4.8,0-7.2c0-2.4,0-5.2,0-8.4c-3.6,0-6.7,0-9.4,0c-2.6,0-5.3,0-7.9,0c-2.6,0-5.8,0-9.4,0c0-0.8,0-1.5,0-2.3
			c0-0.8,0-1.5,0-2.3c3,0,5.7,0,8.1,0s4.9,0,7.6,0c2.7,0,5.2,0,7.6,0s5,0,8.1,0c0,2.8,0,5.2,0,7.4c0,2.2,0,4.5,0,6.9s0,4.8,0,6.9
			c0,2.2,0,4.6,0,7.4H342.4z M347,348.7c0,2.8,0,5.2,0,7.4c0,2.2,0,4.5,0,6.9s0,4.8,0,6.9c0,2.2,0,4.6,0,7.4c-3,0-5.7,0-8.1,0
			s-4.9,0-7.6,0c-2.7,0-5.2,0-7.6,0s-5.1,0-8.1,0c0-0.8,0-1.5,0-2.3c0-0.8,0-1.5,0-2.3c3.6,0,6.7,0,9.4,0c2.6,0,5.3,0,7.9,0
			c2.6,0,5.8,0,9.4,0c0-3.2,0-6,0-8.4s0-4.8,0-7.2s0-5.2,0-8.4H347z M319.8,341.2c0-0.1,0.1-0.1,0.1-0.1c0.1,0,0.2,0,0.3,0
			c3.1,0,5.9,0,8.2,0c2.3,0,4.7,0,7,0s5.1,0,8.2,0c0.2,0,0.3,0,0.3,0c0.1,0,0.1,0.1,0.1,0.1c0,0.1,0,0.2,0,0.3c0,0.5,0,0.9,0,1.3
			c0,0.4,0,0.7,0,1.1c0,0.4,0,0.8,0,1.3c0,0.2,0,0.4-0.1,0.4c0,0-0.2,0.1-0.4,0.1c-3.1,0-5.9,0-8.2,0s-4.7,0-7,0c-2.3,0-5.1,0-8.2,0
			c-0.2,0-0.3,0-0.3,0c-0.1,0-0.1-0.1-0.1-0.1c0-0.1,0-0.2,0-0.3c0-1.2,0-2.5,0-3.7C319.7,341.4,319.8,341.3,319.8,341.2z M347,366
			h-4.6c0-6.1,0-12.6,0-19.6v-0.6v-0.6c0-7.6,0-14.8,0-21.9h4.6V366z"/>
		<path class="st3" d="M342.4,342c0-3.1,0-5.9,0-8.3s0-5,0-7.7c0-2.7,0-5.3,0-7.7c0-2.4,0-5.2,0-8.3c3.2,0,6.1,0,8.7,0
			c2.5,0,5.3,0,8.1,0s5.6,0,8.1,0c2.5,0,5.4,0,8.7,0c0,0.7,0,1.5,0,2.3c0,0.8,0,1.6,0,2.3c-2.8,0-5.3,0-7.5,0c-2.2,0-4.5,0-7,0
			c-2.5,0-4.8,0-7,0c-2.2,0-4.7,0-7.5,0c0,2.6,0,5,0,7.1c0,2.1,0,4.3,0,6.6c0,2.3,0,4.6,0,6.6c0,2.1,0,4.5,0,7.1H342.4z
			 M342.4,355.7v-24.1h4.6c0,2.4,0,4.4,0,6s0,3.6,0,6s0,4.4,0,6c0,1.6,0,3.6,0,6H342.4z M347,345.2c0,2.6,0,5,0,7.1
			c0,2.1,0,4.3,0,6.6c0,2.3,0,4.6,0,6.6c0,2.1,0,4.5,0,7.1c2.8,0,5.3,0,7.5,0c2.2,0,4.5,0,7,0c2.5,0,4.8,0,7,0c2.2,0,4.7,0,7.5,0
			c0,0.7,0,1.5,0,2.3c0,0.8,0,1.6,0,2.3c-3.2,0-6.1,0-8.7,0c-2.6,0-5.3,0-8.1,0s-5.6,0-8.1,0c-2.5,0-5.4,0-8.7,0c0-3.1,0-5.9,0-8.3
			c0-2.4,0-5,0-7.7c0-2.7,0-5.3,0-7.7c0-2.4,0-5.2,0-8.3H347z M373,338.5c-0.1,0-0.1-0.1-0.1-0.1c0-0.1,0-0.2,0-0.3
			c0-3.1,0-5.9,0-8.2c0-2.3,0-4.7,0-7s0-5.1,0-8.2c0-0.2,0-0.3,0-0.3c0-0.1,0.1-0.1,0.1-0.1c0.1,0,0.2,0,0.3,0c0.7,0,1.3,0,1.8,0
			s1.1,0,1.8,0c0.2,0,0.4,0,0.4,0.1c0,0,0.1,0.2,0.1,0.4c0,3.1,0,5.9,0,8.2s0,4.7,0,7c0,2.3,0,5.1,0,8.2c0,0.2,0,0.3,0,0.3
			s-0.1,0.1-0.1,0.1c-0.1,0-0.2,0-0.3,0c-1.2,0-2.5,0-3.7,0C373.2,338.6,373.1,338.5,373,338.5z M372.9,352.8c0.5,0,0.9,0,1.2,0
			s0.7,0,1.1,0c0.4,0,0.8,0,1.2,0c0.4,0,0.8,0,1.2,0c0,0.6,0,1.7,0,3.2c0,1.5,0,3.2,0,5.1c0,1.9,0,3.7,0,5.5s0,3.8,0,6.1
			c2.5,0,4.7,0,6.7,0s4,0,6.2,0c2.2,0,4.3,0,6.2,0s4.2,0,6.7,0c0-2.4,0-4.3,0-5.7c0-1.4,0-2.4,0-2.9c0-0.4,0-0.8,0-1.2s0-0.9,0-1.5
			c0-0.6,0-1.4,0-2.3s0-2.1,0-3.5c0-1.6,0-3,0-4s0-2.4,0-4h4.6c0,1.9,0,4,0,6.2c0,2.3,0,4.7,0,7.2c0,2.5,0,5.2,0,7.9
			c0,2.7,0,5.5,0,8.4c-3.3,0-6.2,0-8.9,0c-2.6,0-5.4,0-8.3,0c-3,0-5.8,0-8.4,0c-2.7,0-4.9,0-6.6,0s-2.7,0-2.8,0c0-0.9,0-1.7,0-2.3
			s0-1.4,0-2.3c0-1.5,0-3.1,0-4.6s0-3,0-4.4s0-2.8,0-4.1c0-1.3,0-2.5,0-3.7C372.9,354.8,372.9,353.7,372.9,352.8z M403.3,342
			c0-2.6,0-5,0-7.1c0-2.1,0-4.3,0-6.6c0-2.3,0-4.6,0-6.6c0-2.1,0-4.5,0-7.1c-2.8,0-5.3,0-7.5,0s-4.5,0-7,0s-4.8,0-7,0s-4.7,0-7.5,0
			c0-0.8,0-1.5,0-2.3c0-0.8,0-1.5,0-2.3c3.2,0,6.1,0,8.7,0s5.3,0,8.1,0s5.6,0,8.1,0c2.5,0,5.4,0,8.7,0c0,3.1,0,5.9,0,8.3
			c0,2.4,0,5,0,7.7c0,2.7,0,5.3,0,7.7s0,5.2,0,8.3H403.3z M403.3,349.6c-1.6-0.8-3.1-1.6-4.3-2.2c-1.2-0.6-2.5-1.2-3.7-1.8
			c-1.2-0.6-2.7-1.3-4.3-2.2c1.6-0.9,3.1-1.6,4.3-2.3s2.5-1.3,3.7-1.9s2.7-1.4,4.3-2.3c0.3,1.2,0.5,2.3,0.7,3.2
			c0.1,1,0.2,1.9,0.2,2.8c0,0.9-0.1,1.9-0.2,2.9C403.9,347,403.7,348.2,403.3,349.6z M407.9,366h-4.6c0-6.1,0-12.6,0-19.6v-0.6v-0.6
			c0-7.6,0-14.8,0-21.9h4.6V366z"/>
	</g>
</g>
</svg>
