<?xml version="1.0" encoding="UTF-8" standalone="no"?>
<svg
   xmlns:dc="http://purl.org/dc/elements/1.1/"
   xmlns:cc="http://creativecommons.org/ns#"
   xmlns:rdf="http://www.w3.org/1999/02/22-rdf-syntax-ns#"
   xmlns:svg="http://www.w3.org/2000/svg"
   xmlns="http://www.w3.org/2000/svg"
   xmlns:sodipodi="http://sodipodi.sourceforge.net/DTD/sodipodi-0.dtd"
   xmlns:inkscape="http://www.inkscape.org/namespaces/inkscape"
   width="13.360903mm"
   height="62.005318mm"
   viewBox="0 0 13.360903 62.005318"
   version="1.1"
   id="svg1721"
   inkscape:version="1.0.2 (e86c870879, 2021-01-15)"
   sodipodi:docname="tube.svg">
  <defs
     id="defs1715" />
  <sodipodi:namedview
     id="base"
     pagecolor="#ffffff"
     bordercolor="#666666"
     borderopacity="1.0"
     inkscape:pageopacity="0.0"
     inkscape:pageshadow="2"
     inkscape:zoom="1.4"
     inkscape:cx="40.352047"
     inkscape:cy="120.56905"
     inkscape:document-units="mm"
     inkscape:current-layer="layer1"
     inkscape:document-rotation="0"
     showgrid="false"
     inkscape:window-width="1366"
     inkscape:window-height="715"
     inkscape:window-x="0"
     inkscape:window-y="0"
     inkscape:window-maximized="1" />
  <metadata
     id="metadata1718">
    <rdf:RDF>
      <cc:Work
         rdf:about="">
        <dc:format>image/svg+xml</dc:format>
        <dc:type
           rdf:resource="http://purl.org/dc/dcmitype/StillImage" />
        <dc:title></dc:title>
      </cc:Work>
    </rdf:RDF>
  </metadata>
  <g
     inkscape:label="Calque 1"
     inkscape:groupmode="layer"
     id="layer1"
     transform="translate(-81.765977,-97.509244)">
    <path
       style="fill:none;stroke:#000000;stroke-width:0.264582;stroke-linecap:round;stroke-miterlimit:4;stroke-dasharray:none;stop-color:#000000"
       d="m 94.994589,97.641535 -0.001,55.145645 c -0.001,2.3575 -1.24908,4.53411 -3.27494,5.71189 -2.02585,1.17777 -4.5218,1.17777 -6.54766,0 -2.02585,-1.17778 -3.27382,-3.35439 -3.27272,-5.71189 l 0.001,-55.145645"
       id="path1663"
       sodipodi:nodetypes="ccsscc" />
  </g>
</svg>
