<?xml version="1.0" encoding="UTF-8" standalone="no"?>
<!-- Created with Inkscape (http://www.inkscape.org/) -->

<svg
   width="20mm"
   height="20mm"
   viewBox="0 0 20 20"
   version="1.1"
   id="svg5881"
   xml:space="preserve"
   inkscape:version="1.2.2 (b0a8486541, 2022-12-01)"
   sodipodi:docname="DEL.svg"
   xmlns:inkscape="http://www.inkscape.org/namespaces/inkscape"
   xmlns:sodipodi="http://sodipodi.sourceforge.net/DTD/sodipodi-0.dtd"
   xmlns="http://www.w3.org/2000/svg"
   xmlns:svg="http://www.w3.org/2000/svg"><sodipodi:namedview
     id="namedview5883"
     pagecolor="#ffffff"
     bordercolor="#666666"
     borderopacity="1.0"
     inkscape:showpageshadow="2"
     inkscape:pageopacity="0.0"
     inkscape:pagecheckerboard="0"
     inkscape:deskcolor="#d1d1d1"
     inkscape:document-units="mm"
     showgrid="false"
     inkscape:zoom="4.7572176"
     inkscape:cx="-56.440555"
     inkscape:cy="22.492139"
     inkscape:window-width="1920"
     inkscape:window-height="1007"
     inkscape:window-x="0"
     inkscape:window-y="0"
     inkscape:window-maximized="1"
     inkscape:current-layer="layer1" /><defs
     id="defs5878" /><g
     inkscape:label="Calque 1"
     inkscape:groupmode="layer"
     id="layer1"><path
       sodipodi:type="star"
       style="opacity:1;fill:#ffffff;stroke:#000000;stroke-width:0.499999;stroke-linecap:butt;stroke-dasharray:none;paint-order:markers fill stroke;stop-color:#000000"
       id="path16435"
       inkscape:flatsided="true"
       sodipodi:sides="3"
       sodipodi:cx="4.7979341"
       sodipodi:cy="5.2952976"
       sodipodi:r1="5.7439451"
       sodipodi:r2="2.8719723"
       sodipodi:arg1="0"
       sodipodi:arg2="1.0471976"
       inkscape:rounded="0"
       inkscape:randomized="0"
       d="M 10.541879,5.2952976 1.9259615,10.2697 l 0,-9.94880477 z"
       inkscape:transform-center-x="-1.4359861"
       transform="translate(3.6410799,4.7047024)" /><path
       style="opacity:1;fill:#ffffff;stroke:#000000;stroke-width:0.499999;stroke-linecap:butt;stroke-dasharray:none;paint-order:markers fill stroke;stop-color:#000000"
       d="M 0,10 H 20"
       id="path16018" /><path
       style="opacity:1;fill:#ffffff;stroke:#000000;stroke-width:0.499999;stroke-linecap:butt;stroke-dasharray:none;paint-order:markers fill stroke;stop-color:#000000"
       d="M 14.03371,5.0255976 V 14.974402"
       id="path16500" /><g
       id="g17349"
       transform="translate(-0.856459)"><g
         id="g17302"
         transform="translate(22.135663,-3.2240175)"><path
           style="opacity:1;fill:#ffffff;stroke:#000000;stroke-width:0.499999;stroke-linecap:round;stroke-dasharray:none;paint-order:markers fill stroke;stop-color:#000000"
           d="m -14.630319,6.8613999 3.053686,-3.3873587"
           id="path16525"
           inkscape:transform-center-x="1.5272976"
           inkscape:transform-center-y="1.6941835" /><path
           style="fill:#ffffff;stroke:#000000;stroke-width:0.499999;stroke-linecap:round;stroke-dasharray:none;paint-order:markers fill stroke;stop-color:#000000"
           d="M -14.065547,4.0663085 -11.576658,3.474017"
           id="path16525-1"
           inkscape:transform-center-x="1.1011653"
           inkscape:transform-center-y="0.23596398" /><path
           style="fill:#ffffff;stroke:#000000;stroke-width:0.499999;stroke-linecap:round;stroke-dasharray:none;paint-order:markers fill stroke;stop-color:#000000"
           d="m -11.795136,6.0316751 0.218478,-2.5490478"
           id="path16525-1-2"
           inkscape:transform-center-x="0.05117181"
           inkscape:transform-center-y="1.0842379" /></g><g
         id="g17302-7"
         transform="translate(25.784207,-3.2240175)"><path
           style="opacity:1;fill:#ffffff;stroke:#000000;stroke-width:0.499999;stroke-linecap:round;stroke-dasharray:none;paint-order:markers fill stroke;stop-color:#000000"
           d="m -14.630319,6.8613999 3.053686,-3.3873587"
           id="path16525-0"
           inkscape:transform-center-x="1.5272976"
           inkscape:transform-center-y="1.6941835" /><path
           style="fill:#ffffff;stroke:#000000;stroke-width:0.499999;stroke-linecap:round;stroke-dasharray:none;paint-order:markers fill stroke;stop-color:#000000"
           d="M -14.065547,4.0663085 -11.576658,3.474017"
           id="path16525-1-9"
           inkscape:transform-center-x="1.1011653"
           inkscape:transform-center-y="0.23596398" /><path
           style="fill:#ffffff;stroke:#000000;stroke-width:0.499999;stroke-linecap:round;stroke-dasharray:none;paint-order:markers fill stroke;stop-color:#000000"
           d="m -11.795136,6.0316751 0.218478,-2.5490478"
           id="path16525-1-2-3"
           inkscape:transform-center-x="0.05117181"
           inkscape:transform-center-y="1.0842379" /></g></g></g></svg>
