\relax 
\providecommand\babel@aux[2]{}
\@nameuse{bbl@beforestart}
\catcode `:\active 
\catcode `;\active 
\catcode `!\active 
\catcode `?\active 
\ifx\qr@savematrix\@undefined\def\qr@savematrix{\begingroup\let\do\@makeother\dospecials\catcode`\{=1\catcode`\}=2\relax \qr@savematrix@int}\def\qr@savematrix@int#1#2#3#4{\endgroup}\fi
\babel@aux{french}{}
\babel@aux{french}{}
\@writefile{toc}{\contentsline {chapter}{\numberline {18}Correction\\ Plan de travail :\\ Vecteurs\\ sans coordonnées }{1}{}\protected@file@percent }
\@writefile{lof}{\addvspace {10\p@ }}
\@writefile{lot}{\addvspace {10\p@ }}
\@writefile{cor}{\smc@corrigechapter {Chapitre{} G18} {Correction\\ Plan de travail :\\ Vecteurs\\ sans coordonnées }{PartieGeometrie}{Blanc}}
\@writefile{cor}{\smc@corrigeexercicesbase }
\gdef \@abspage@last{2}
