<?xml version="1.0" encoding="UTF-8" standalone="no"?>
<svg
   xmlns:dc="http://purl.org/dc/elements/1.1/"
   xmlns:cc="http://creativecommons.org/ns#"
   xmlns:rdf="http://www.w3.org/1999/02/22-rdf-syntax-ns#"
   xmlns:svg="http://www.w3.org/2000/svg"
   xmlns="http://www.w3.org/2000/svg"
   xmlns:xlink="http://www.w3.org/1999/xlink"
   xmlns:sodipodi="http://sodipodi.sourceforge.net/DTD/sodipodi-0.dtd"
   xmlns:inkscape="http://www.inkscape.org/namespaces/inkscape"
   version="1.1"
   id="svg2"
   xml:space="preserve"
   width="199.90001mm"
   height="199.90001mm"
   viewBox="0 0 755.52759 755.52766"
   sodipodi:docname="WTF-14.svg"
   inkscape:version="1.0beta2 (unknown)"
   inkscape:export-filename="/media/hugo/Bonus/Prof/2de/Ph3 Mouvements &amp; Forces/Ph3-1 Mouvements/TP Trajectoire/Sources/WTF-20.png"
   inkscape:export-xdpi="299"
   inkscape:export-ydpi="299"><metadata
     id="metadata8"><rdf:RDF><cc:Work
         rdf:about=""><dc:format>image/svg+xml</dc:format><dc:type
           rdf:resource="http://purl.org/dc/dcmitype/StillImage" /><dc:title></dc:title></cc:Work></rdf:RDF></metadata><defs
     id="defs6"><clipPath
       clipPathUnits="userSpaceOnUse"
       id="clipPath18"><path
         d="M 8.871e-6,0 H 595.32001 V 842.04 H 8.871e-6 Z"
         id="path16"
         inkscape:connector-curvature="0"
         style="clip-rule:evenodd" /></clipPath><clipPath
       clipPathUnits="userSpaceOnUse"
       id="clipPath30"><path
         d="M 8.871e-6,0 H 595.32001 V 842.04 H 8.871e-6 Z"
         id="path28"
         inkscape:connector-curvature="0"
         style="clip-rule:evenodd" /></clipPath><clipPath
       clipPathUnits="userSpaceOnUse"
       id="clipPath42"><path
         d="M 8.871e-6,0 H 595.32001 V 842.04 H 8.871e-6 Z"
         id="path40"
         inkscape:connector-curvature="0"
         style="clip-rule:evenodd" /></clipPath><clipPath
       clipPathUnits="userSpaceOnUse"
       id="clipPath50"><path
         d="M 8.871e-6,0 H 595.32001 V 842.04 H 8.871e-6 Z"
         id="path48"
         inkscape:connector-curvature="0"
         style="clip-rule:evenodd" /></clipPath><clipPath
       clipPathUnits="userSpaceOnUse"
       id="clipPath62"><path
         d="M 8.871e-6,0 H 595.32001 V 842.04 H 8.871e-6 Z"
         id="path60"
         inkscape:connector-curvature="0"
         style="clip-rule:evenodd" /></clipPath><clipPath
       clipPathUnits="userSpaceOnUse"
       id="clipPath74"><path
         d="M 8.871e-6,0 H 595.32001 V 842.04 H 8.871e-6 Z"
         id="path72"
         inkscape:connector-curvature="0"
         style="clip-rule:evenodd" /></clipPath><clipPath
       clipPathUnits="userSpaceOnUse"
       id="clipPath82"><path
         d="M 8.871e-6,0 H 595.32001 V 842.04 H 8.871e-6 Z"
         id="path80"
         inkscape:connector-curvature="0"
         style="clip-rule:evenodd" /></clipPath><clipPath
       clipPathUnits="userSpaceOnUse"
       id="clipPath94"><path
         d="M 8.871e-6,0 H 595.32001 V 842.04 H 8.871e-6 Z"
         id="path92"
         inkscape:connector-curvature="0"
         style="clip-rule:evenodd" /></clipPath><clipPath
       clipPathUnits="userSpaceOnUse"
       id="clipPath102"><path
         d="M 8.871e-6,0 H 595.32001 V 842.04 H 8.871e-6 Z"
         id="path100"
         inkscape:connector-curvature="0"
         style="clip-rule:evenodd" /></clipPath><clipPath
       clipPathUnits="userSpaceOnUse"
       id="clipPath114"><path
         d="M 8.871e-6,0 H 595.32001 V 842.04 H 8.871e-6 Z"
         id="path112"
         inkscape:connector-curvature="0"
         style="clip-rule:evenodd" /></clipPath><clipPath
       clipPathUnits="userSpaceOnUse"
       id="clipPath122"><path
         d="M 8.871e-6,0 H 595.32001 V 842.04 H 8.871e-6 Z"
         id="path120"
         inkscape:connector-curvature="0"
         style="clip-rule:evenodd" /></clipPath><clipPath
       clipPathUnits="userSpaceOnUse"
       id="clipPath130"><path
         d="M 8.871e-6,0 H 595.32001 V 842.04 H 8.871e-6 Z"
         id="path128"
         inkscape:connector-curvature="0"
         style="clip-rule:evenodd" /></clipPath><clipPath
       clipPathUnits="userSpaceOnUse"
       id="clipPath142"><path
         d="M 8.871e-6,0 H 595.32001 V 842.04 H 8.871e-6 Z"
         id="path140"
         inkscape:connector-curvature="0"
         style="clip-rule:evenodd" /></clipPath><clipPath
       clipPathUnits="userSpaceOnUse"
       id="clipPath150"><path
         d="M 8.871e-6,0 H 595.32001 V 842.04 H 8.871e-6 Z"
         id="path148"
         inkscape:connector-curvature="0"
         style="clip-rule:evenodd" /></clipPath><clipPath
       clipPathUnits="userSpaceOnUse"
       id="clipPath162"><path
         d="m 36,803.69 h 37.5 v 17.35 H 36 Z"
         id="path160"
         inkscape:connector-curvature="0"
         style="clip-rule:evenodd" /></clipPath><clipPath
       clipPathUnits="userSpaceOnUse"
       id="clipPath174"><path
         d="m 36,21.171 h 115.6 v 27.2 H 36 Z"
         id="path172"
         inkscape:connector-curvature="0"
         style="clip-rule:evenodd" /></clipPath><clipPath
       clipPathUnits="userSpaceOnUse"
       id="clipPath186"><path
         d="M 8.871e-6,0 H 595.32001 V 842.04 H 8.871e-6 Z"
         id="path184"
         inkscape:connector-curvature="0"
         style="clip-rule:evenodd" /></clipPath><clipPath
       clipPathUnits="userSpaceOnUse"
       id="clipPath194"><path
         d="M 8.871e-6,0 H 595.32001 V 842.04 H 8.871e-6 Z"
         id="path192"
         inkscape:connector-curvature="0"
         style="clip-rule:evenodd" /></clipPath><clipPath
       clipPathUnits="userSpaceOnUse"
       id="clipPath202"><path
         d="M 8.871e-6,0 H 595.32001 V 842.04 H 8.871e-6 Z"
         id="path200"
         inkscape:connector-curvature="0"
         style="clip-rule:evenodd" /></clipPath><clipPath
       clipPathUnits="userSpaceOnUse"
       id="clipPath214"><path
         d="M 8.871e-6,0 H 595.32001 V 842.04 H 8.871e-6 Z"
         id="path212"
         inkscape:connector-curvature="0"
         style="clip-rule:evenodd" /></clipPath><clipPath
       clipPathUnits="userSpaceOnUse"
       id="clipPath222"><path
         d="M 8.871e-6,0 H 595.32001 V 842.04 H 8.871e-6 Z"
         id="path220"
         inkscape:connector-curvature="0"
         style="clip-rule:evenodd" /></clipPath><clipPath
       clipPathUnits="userSpaceOnUse"
       id="clipPath234"><path
         d="M 8.871e-6,0 H 595.32001 V 842.04 H 8.871e-6 Z"
         id="path232"
         inkscape:connector-curvature="0"
         style="clip-rule:evenodd" /></clipPath><clipPath
       clipPathUnits="userSpaceOnUse"
       id="clipPath242"><path
         d="M 8.871e-6,0 H 595.32001 V 842.04 H 8.871e-6 Z"
         id="path240"
         inkscape:connector-curvature="0"
         style="clip-rule:evenodd" /></clipPath><clipPath
       clipPathUnits="userSpaceOnUse"
       id="clipPath254"><path
         d="M 8.871e-6,0 H 595.32001 V 842.04 H 8.871e-6 Z"
         id="path252"
         inkscape:connector-curvature="0"
         style="clip-rule:evenodd" /></clipPath><clipPath
       clipPathUnits="userSpaceOnUse"
       id="clipPath266"><path
         d="M 8.871e-6,0 H 595.32001 V 842.04 H 8.871e-6 Z"
         id="path264"
         inkscape:connector-curvature="0"
         style="clip-rule:evenodd" /></clipPath><clipPath
       clipPathUnits="userSpaceOnUse"
       id="clipPath278"><path
         d="M 8.871e-6,0 H 595.32001 V 842.04 H 8.871e-6 Z"
         id="path276"
         inkscape:connector-curvature="0"
         style="clip-rule:evenodd" /></clipPath><clipPath
       clipPathUnits="userSpaceOnUse"
       id="clipPath290"><path
         d="M 8.871e-6,0 H 595.32001 V 842.04 H 8.871e-6 Z"
         id="path288"
         inkscape:connector-curvature="0"
         style="clip-rule:evenodd" /></clipPath><clipPath
       clipPathUnits="userSpaceOnUse"
       id="clipPath302"><path
         d="M 8.871e-6,0 H 595.32001 V 842.04 H 8.871e-6 Z"
         id="path300"
         inkscape:connector-curvature="0"
         style="clip-rule:evenodd" /></clipPath><clipPath
       clipPathUnits="userSpaceOnUse"
       id="clipPath314"><path
         d="M 8.871e-6,0 H 595.32001 V 842.04 H 8.871e-6 Z"
         id="path312"
         inkscape:connector-curvature="0"
         style="clip-rule:evenodd" /></clipPath><clipPath
       clipPathUnits="userSpaceOnUse"
       id="clipPath322"><path
         d="M 8.871e-6,0 H 595.32001 V 842.04 H 8.871e-6 Z"
         id="path320"
         inkscape:connector-curvature="0"
         style="clip-rule:evenodd" /></clipPath><clipPath
       clipPathUnits="userSpaceOnUse"
       id="clipPath334"><path
         d="M 8.871e-6,0 H 595.32001 V 842.04 H 8.871e-6 Z"
         id="path332"
         inkscape:connector-curvature="0"
         style="clip-rule:evenodd" /></clipPath><clipPath
       clipPathUnits="userSpaceOnUse"
       id="clipPath342"><path
         d="M 8.871e-6,0 H 595.32001 V 842.04 H 8.871e-6 Z"
         id="path340"
         inkscape:connector-curvature="0"
         style="clip-rule:evenodd" /></clipPath><clipPath
       clipPathUnits="userSpaceOnUse"
       id="clipPath354"><path
         d="M 8.871e-6,0 H 595.32001 V 842.04 H 8.871e-6 Z"
         id="path352"
         inkscape:connector-curvature="0"
         style="clip-rule:evenodd" /></clipPath><clipPath
       clipPathUnits="userSpaceOnUse"
       id="clipPath366"><path
         d="M 8.871e-6,0 H 595.32001 V 842.04 H 8.871e-6 Z"
         id="path364"
         inkscape:connector-curvature="0"
         style="clip-rule:evenodd" /></clipPath><clipPath
       clipPathUnits="userSpaceOnUse"
       id="clipPath374"><path
         d="M 8.871e-6,0 H 595.32001 V 842.04 H 8.871e-6 Z"
         id="path372"
         inkscape:connector-curvature="0"
         style="clip-rule:evenodd" /></clipPath><clipPath
       clipPathUnits="userSpaceOnUse"
       id="clipPath386"><path
         d="M 8.871e-6,0 H 595.32001 V 842.04 H 8.871e-6 Z"
         id="path384"
         inkscape:connector-curvature="0"
         style="clip-rule:evenodd" /></clipPath><clipPath
       clipPathUnits="userSpaceOnUse"
       id="clipPath394"><path
         d="M 8.871e-6,0 H 595.32001 V 842.04 H 8.871e-6 Z"
         id="path392"
         inkscape:connector-curvature="0"
         style="clip-rule:evenodd" /></clipPath><clipPath
       clipPathUnits="userSpaceOnUse"
       id="clipPath406"><path
         d="M 8.871e-6,0 H 595.32001 V 842.04 H 8.871e-6 Z"
         id="path404"
         inkscape:connector-curvature="0"
         style="clip-rule:evenodd" /></clipPath><clipPath
       clipPathUnits="userSpaceOnUse"
       id="clipPath418"><path
         d="M 8.871e-6,0 H 595.32001 V 842.04 H 8.871e-6 Z"
         id="path416"
         inkscape:connector-curvature="0"
         style="clip-rule:evenodd" /></clipPath><clipPath
       clipPathUnits="userSpaceOnUse"
       id="clipPath430"><path
         d="M 8.871e-6,0 H 595.32001 V 842.04 H 8.871e-6 Z"
         id="path428"
         inkscape:connector-curvature="0"
         style="clip-rule:evenodd" /></clipPath><clipPath
       clipPathUnits="userSpaceOnUse"
       id="clipPath442"><path
         d="M 8.871e-6,0 H 595.32001 V 842.04 H 8.871e-6 Z"
         id="path440"
         inkscape:connector-curvature="0"
         style="clip-rule:evenodd" /></clipPath><clipPath
       clipPathUnits="userSpaceOnUse"
       id="clipPath454"><path
         d="M 8.871e-6,0 H 595.32001 V 842.04 H 8.871e-6 Z"
         id="path452"
         inkscape:connector-curvature="0"
         style="clip-rule:evenodd" /></clipPath><clipPath
       clipPathUnits="userSpaceOnUse"
       id="clipPath466"><path
         d="M 8.871e-6,0 H 595.32001 V 842.04 H 8.871e-6 Z"
         id="path464"
         inkscape:connector-curvature="0"
         style="clip-rule:evenodd" /></clipPath><clipPath
       clipPathUnits="userSpaceOnUse"
       id="clipPath474"><path
         d="M 8.871e-6,0 H 595.32001 V 842.04 H 8.871e-6 Z"
         id="path472"
         inkscape:connector-curvature="0"
         style="clip-rule:evenodd" /></clipPath><clipPath
       clipPathUnits="userSpaceOnUse"
       id="clipPath486"><path
         d="M 8.871e-6,0 H 595.32001 V 842.04 H 8.871e-6 Z"
         id="path484"
         inkscape:connector-curvature="0"
         style="clip-rule:evenodd" /></clipPath><clipPath
       clipPathUnits="userSpaceOnUse"
       id="clipPath498"><path
         d="M 8.871e-6,0 H 595.32001 V 842.04 H 8.871e-6 Z"
         id="path496"
         inkscape:connector-curvature="0"
         style="clip-rule:evenodd" /></clipPath><clipPath
       clipPathUnits="userSpaceOnUse"
       id="clipPath510"><path
         d="M 8.871e-6,0 H 595.32001 V 842.04 H 8.871e-6 Z"
         id="path508"
         inkscape:connector-curvature="0"
         style="clip-rule:evenodd" /></clipPath><clipPath
       clipPathUnits="userSpaceOnUse"
       id="clipPath522"><path
         d="M 8.871e-6,0 H 595.32001 V 842.04 H 8.871e-6 Z"
         id="path520"
         inkscape:connector-curvature="0"
         style="clip-rule:evenodd" /></clipPath><clipPath
       clipPathUnits="userSpaceOnUse"
       id="clipPath530"><path
         d="M 8.871e-6,0 H 595.32001 V 842.04 H 8.871e-6 Z"
         id="path528"
         inkscape:connector-curvature="0"
         style="clip-rule:evenodd" /></clipPath><clipPath
       clipPathUnits="userSpaceOnUse"
       id="clipPath542"><path
         d="M 8.871e-6,0 H 595.32001 V 842.04 H 8.871e-6 Z"
         id="path540"
         inkscape:connector-curvature="0"
         style="clip-rule:evenodd" /></clipPath><clipPath
       clipPathUnits="userSpaceOnUse"
       id="clipPath550"><path
         d="M 8.871e-6,0 H 595.32001 V 842.04 H 8.871e-6 Z"
         id="path548"
         inkscape:connector-curvature="0"
         style="clip-rule:evenodd" /></clipPath><clipPath
       clipPathUnits="userSpaceOnUse"
       id="clipPath562"><path
         d="M 8.871e-6,0 H 595.32001 V 842.04 H 8.871e-6 Z"
         id="path560"
         inkscape:connector-curvature="0"
         style="clip-rule:evenodd" /></clipPath><clipPath
       clipPathUnits="userSpaceOnUse"
       id="clipPath574"><path
         d="M 8.871e-6,0 H 595.32001 V 842.04 H 8.871e-6 Z"
         id="path572"
         inkscape:connector-curvature="0"
         style="clip-rule:evenodd" /></clipPath><clipPath
       clipPathUnits="userSpaceOnUse"
       id="clipPath586"><path
         d="M 8.871e-6,0 H 595.32001 V 842.04 H 8.871e-6 Z"
         id="path584"
         inkscape:connector-curvature="0"
         style="clip-rule:evenodd" /></clipPath><clipPath
       clipPathUnits="userSpaceOnUse"
       id="clipPath598"><path
         d="M 8.871e-6,0 H 595.32001 V 842.04 H 8.871e-6 Z"
         id="path596"
         inkscape:connector-curvature="0"
         style="clip-rule:evenodd" /></clipPath><clipPath
       clipPathUnits="userSpaceOnUse"
       id="clipPath606"><path
         d="M 8.871e-6,0 H 595.32001 V 842.04 H 8.871e-6 Z"
         id="path604"
         inkscape:connector-curvature="0"
         style="clip-rule:evenodd" /></clipPath><clipPath
       clipPathUnits="userSpaceOnUse"
       id="clipPath618"><path
         d="M 8.871e-6,0 H 595.32001 V 842.04 H 8.871e-6 Z"
         id="path616"
         inkscape:connector-curvature="0"
         style="clip-rule:evenodd" /></clipPath><clipPath
       clipPathUnits="userSpaceOnUse"
       id="clipPath626"><path
         d="M 8.871e-6,0 H 595.32001 V 842.04 H 8.871e-6 Z"
         id="path624"
         inkscape:connector-curvature="0"
         style="clip-rule:evenodd" /></clipPath><clipPath
       clipPathUnits="userSpaceOnUse"
       id="clipPath638"><path
         d="M 8.871e-6,0 H 595.32001 V 842.04 H 8.871e-6 Z"
         id="path636"
         inkscape:connector-curvature="0"
         style="clip-rule:evenodd" /></clipPath><clipPath
       clipPathUnits="userSpaceOnUse"
       id="clipPath650"><path
         d="M 8.871e-6,0 H 595.32001 V 842.04 H 8.871e-6 Z"
         id="path648"
         inkscape:connector-curvature="0"
         style="clip-rule:evenodd" /></clipPath><clipPath
       clipPathUnits="userSpaceOnUse"
       id="clipPath658"><path
         d="M 8.871e-6,0 H 595.32001 V 842.04 H 8.871e-6 Z"
         id="path656"
         inkscape:connector-curvature="0"
         style="clip-rule:evenodd" /></clipPath><clipPath
       clipPathUnits="userSpaceOnUse"
       id="clipPath670"><path
         d="M 8.871e-6,0 H 595.32001 V 842.04 H 8.871e-6 Z"
         id="path668"
         inkscape:connector-curvature="0"
         style="clip-rule:evenodd" /></clipPath><clipPath
       clipPathUnits="userSpaceOnUse"
       id="clipPath682"><path
         d="M 8.871e-6,0 H 595.32001 V 842.04 H 8.871e-6 Z"
         id="path680"
         inkscape:connector-curvature="0"
         style="clip-rule:evenodd" /></clipPath><clipPath
       clipPathUnits="userSpaceOnUse"
       id="clipPath694"><path
         d="M 8.871e-6,0 H 595.32001 V 842.04 H 8.871e-6 Z"
         id="path692"
         inkscape:connector-curvature="0"
         style="clip-rule:evenodd" /></clipPath><clipPath
       clipPathUnits="userSpaceOnUse"
       id="clipPath706"><path
         d="M 8.871e-6,0 H 595.32001 V 842.04 H 8.871e-6 Z"
         id="path704"
         inkscape:connector-curvature="0"
         style="clip-rule:evenodd" /></clipPath><clipPath
       clipPathUnits="userSpaceOnUse"
       id="clipPath718"><path
         d="M 8.871e-6,0 H 595.32001 V 842.04 H 8.871e-6 Z"
         id="path716"
         inkscape:connector-curvature="0"
         style="clip-rule:evenodd" /></clipPath><clipPath
       clipPathUnits="userSpaceOnUse"
       id="clipPath730"><path
         d="M 8.871e-6,0 H 595.32001 V 842.04 H 8.871e-6 Z"
         id="path728"
         inkscape:connector-curvature="0"
         style="clip-rule:evenodd" /></clipPath><clipPath
       clipPathUnits="userSpaceOnUse"
       id="clipPath738"><path
         d="M 8.871e-6,0 H 595.32001 V 842.04 H 8.871e-6 Z"
         id="path736"
         inkscape:connector-curvature="0"
         style="clip-rule:evenodd" /></clipPath><clipPath
       clipPathUnits="userSpaceOnUse"
       id="clipPath750"><path
         d="M 8.871e-6,0 H 595.32001 V 842.04 H 8.871e-6 Z"
         id="path748"
         inkscape:connector-curvature="0"
         style="clip-rule:evenodd" /></clipPath><clipPath
       clipPathUnits="userSpaceOnUse"
       id="clipPath758"><path
         d="M 8.871e-6,0 H 595.32001 V 842.04 H 8.871e-6 Z"
         id="path756"
         inkscape:connector-curvature="0"
         style="clip-rule:evenodd" /></clipPath><clipPath
       clipPathUnits="userSpaceOnUse"
       id="clipPath770"><path
         d="M 8.871e-6,0 H 595.32001 V 842.04 H 8.871e-6 Z"
         id="path768"
         inkscape:connector-curvature="0"
         style="clip-rule:evenodd" /></clipPath><clipPath
       clipPathUnits="userSpaceOnUse"
       id="clipPath782"><path
         d="M 8.871e-6,0 H 595.32001 V 842.04 H 8.871e-6 Z"
         id="path780"
         inkscape:connector-curvature="0"
         style="clip-rule:evenodd" /></clipPath><clipPath
       clipPathUnits="userSpaceOnUse"
       id="clipPath790"><path
         d="M 8.871e-6,0 H 595.32001 V 842.04 H 8.871e-6 Z"
         id="path788"
         inkscape:connector-curvature="0"
         style="clip-rule:evenodd" /></clipPath><clipPath
       clipPathUnits="userSpaceOnUse"
       id="clipPath802"><path
         d="M 8.871e-6,0 H 595.32001 V 842.04 H 8.871e-6 Z"
         id="path800"
         inkscape:connector-curvature="0"
         style="clip-rule:evenodd" /></clipPath><clipPath
       clipPathUnits="userSpaceOnUse"
       id="clipPath810"><path
         d="M 8.871e-6,0 H 595.32001 V 842.04 H 8.871e-6 Z"
         id="path808"
         inkscape:connector-curvature="0"
         style="clip-rule:evenodd" /></clipPath><clipPath
       clipPathUnits="userSpaceOnUse"
       id="clipPath822"><path
         d="M 8.871e-6,0 H 595.32001 V 842.04 H 8.871e-6 Z"
         id="path820"
         inkscape:connector-curvature="0"
         style="clip-rule:evenodd" /></clipPath><clipPath
       clipPathUnits="userSpaceOnUse"
       id="clipPath834"><path
         d="M 8.871e-6,0 H 595.32001 V 842.04 H 8.871e-6 Z"
         id="path832"
         inkscape:connector-curvature="0"
         style="clip-rule:evenodd" /></clipPath><clipPath
       clipPathUnits="userSpaceOnUse"
       id="clipPath846"><path
         d="M 8.871e-6,0 H 595.32001 V 842.04 H 8.871e-6 Z"
         id="path844"
         inkscape:connector-curvature="0"
         style="clip-rule:evenodd" /></clipPath><clipPath
       clipPathUnits="userSpaceOnUse"
       id="clipPath858"><path
         d="M 8.871e-6,0 H 595.32001 V 842.04 H 8.871e-6 Z"
         id="path856"
         inkscape:connector-curvature="0"
         style="clip-rule:evenodd" /></clipPath><clipPath
       clipPathUnits="userSpaceOnUse"
       id="clipPath870"><path
         d="M 8.871e-6,0 H 595.32001 V 842.04 H 8.871e-6 Z"
         id="path868"
         inkscape:connector-curvature="0"
         style="clip-rule:evenodd" /></clipPath><clipPath
       clipPathUnits="userSpaceOnUse"
       id="clipPath882"><path
         d="M 8.871e-6,0 H 595.32001 V 842.04 H 8.871e-6 Z"
         id="path880"
         inkscape:connector-curvature="0"
         style="clip-rule:evenodd" /></clipPath><clipPath
       clipPathUnits="userSpaceOnUse"
       id="clipPath890"><path
         d="M 8.871e-6,0 H 595.32001 V 842.04 H 8.871e-6 Z"
         id="path888"
         inkscape:connector-curvature="0"
         style="clip-rule:evenodd" /></clipPath><clipPath
       clipPathUnits="userSpaceOnUse"
       id="clipPath902"><path
         d="M 8.871e-6,0 H 595.32001 V 842.04 H 8.871e-6 Z"
         id="path900"
         inkscape:connector-curvature="0"
         style="clip-rule:evenodd" /></clipPath><clipPath
       clipPathUnits="userSpaceOnUse"
       id="clipPath910"><path
         d="M 8.871e-6,0 H 595.32001 V 842.04 H 8.871e-6 Z"
         id="path908"
         inkscape:connector-curvature="0"
         style="clip-rule:evenodd" /></clipPath><clipPath
       clipPathUnits="userSpaceOnUse"
       id="clipPath922"><path
         d="M 8.871e-6,0 H 595.32001 V 842.04 H 8.871e-6 Z"
         id="path920"
         inkscape:connector-curvature="0"
         style="clip-rule:evenodd" /></clipPath><clipPath
       clipPathUnits="userSpaceOnUse"
       id="clipPath930"><path
         d="M 8.871e-6,0 H 595.32001 V 842.04 H 8.871e-6 Z"
         id="path928"
         inkscape:connector-curvature="0"
         style="clip-rule:evenodd" /></clipPath><clipPath
       clipPathUnits="userSpaceOnUse"
       id="clipPath942"><path
         d="M 8.871e-6,0 H 595.32001 V 842.04 H 8.871e-6 Z"
         id="path940"
         inkscape:connector-curvature="0"
         style="clip-rule:evenodd" /></clipPath><clipPath
       clipPathUnits="userSpaceOnUse"
       id="clipPath950"><path
         d="M 8.871e-6,0 H 595.32001 V 842.04 H 8.871e-6 Z"
         id="path948"
         inkscape:connector-curvature="0"
         style="clip-rule:evenodd" /></clipPath><clipPath
       clipPathUnits="userSpaceOnUse"
       id="clipPath962"><path
         d="M 8.871e-6,0 H 595.32001 V 842.04 H 8.871e-6 Z"
         id="path960"
         inkscape:connector-curvature="0"
         style="clip-rule:evenodd" /></clipPath><clipPath
       clipPathUnits="userSpaceOnUse"
       id="clipPath974"><path
         d="M 8.871e-6,0 H 595.32001 V 842.04 H 8.871e-6 Z"
         id="path972"
         inkscape:connector-curvature="0"
         style="clip-rule:evenodd" /></clipPath><clipPath
       clipPathUnits="userSpaceOnUse"
       id="clipPath986"><path
         d="M 8.871e-6,0 H 595.32001 V 842.04 H 8.871e-6 Z"
         id="path984"
         inkscape:connector-curvature="0"
         style="clip-rule:evenodd" /></clipPath><clipPath
       clipPathUnits="userSpaceOnUse"
       id="clipPath998"><path
         d="M 8.871e-6,0 H 595.32001 V 842.04 H 8.871e-6 Z"
         id="path996"
         inkscape:connector-curvature="0"
         style="clip-rule:evenodd" /></clipPath><clipPath
       clipPathUnits="userSpaceOnUse"
       id="clipPath1010"><path
         d="M 8.871e-6,0 H 595.32001 V 842.04 H 8.871e-6 Z"
         id="path1008"
         inkscape:connector-curvature="0"
         style="clip-rule:evenodd" /></clipPath><clipPath
       clipPathUnits="userSpaceOnUse"
       id="clipPath1022"><path
         d="M 8.871e-6,0 H 595.32001 V 842.04 H 8.871e-6 Z"
         id="path1020"
         inkscape:connector-curvature="0"
         style="clip-rule:evenodd" /></clipPath><clipPath
       clipPathUnits="userSpaceOnUse"
       id="clipPath1034"><path
         d="M 8.871e-6,0 H 595.32001 V 842.04 H 8.871e-6 Z"
         id="path1032"
         inkscape:connector-curvature="0"
         style="clip-rule:evenodd" /></clipPath><clipPath
       clipPathUnits="userSpaceOnUse"
       id="clipPath1042"><path
         d="M 8.871e-6,0 H 595.32001 V 842.04 H 8.871e-6 Z"
         id="path1040"
         inkscape:connector-curvature="0"
         style="clip-rule:evenodd" /></clipPath><clipPath
       clipPathUnits="userSpaceOnUse"
       id="clipPath1054"><path
         d="M 8.871e-6,0 H 595.32001 V 842.04 H 8.871e-6 Z"
         id="path1052"
         inkscape:connector-curvature="0"
         style="clip-rule:evenodd" /></clipPath><clipPath
       clipPathUnits="userSpaceOnUse"
       id="clipPath1066"><path
         d="M 8.871e-6,0 H 595.32001 V 842.04 H 8.871e-6 Z"
         id="path1064"
         inkscape:connector-curvature="0"
         style="clip-rule:evenodd" /></clipPath><clipPath
       clipPathUnits="userSpaceOnUse"
       id="clipPath1078"><path
         d="M 8.871e-6,0 H 595.32001 V 842.04 H 8.871e-6 Z"
         id="path1076"
         inkscape:connector-curvature="0"
         style="clip-rule:evenodd" /></clipPath><clipPath
       clipPathUnits="userSpaceOnUse"
       id="clipPath1090"><path
         d="M 8.871e-6,0 H 595.32001 V 842.04 H 8.871e-6 Z"
         id="path1088"
         inkscape:connector-curvature="0"
         style="clip-rule:evenodd" /></clipPath><clipPath
       clipPathUnits="userSpaceOnUse"
       id="clipPath1102"><path
         d="M 8.871e-6,0 H 595.32001 V 842.04 H 8.871e-6 Z"
         id="path1100"
         inkscape:connector-curvature="0"
         style="clip-rule:evenodd" /></clipPath><clipPath
       clipPathUnits="userSpaceOnUse"
       id="clipPath1114"><path
         d="M 8.871e-6,0 H 595.32001 V 842.04 H 8.871e-6 Z"
         id="path1112"
         inkscape:connector-curvature="0"
         style="clip-rule:evenodd" /></clipPath><clipPath
       clipPathUnits="userSpaceOnUse"
       id="clipPath1122"><path
         d="M 8.871e-6,0 H 595.32001 V 842.04 H 8.871e-6 Z"
         id="path1120"
         inkscape:connector-curvature="0"
         style="clip-rule:evenodd" /></clipPath><clipPath
       clipPathUnits="userSpaceOnUse"
       id="clipPath1130"><path
         d="M 8.871e-6,0 H 595.32001 V 842.04 H 8.871e-6 Z"
         id="path1128"
         inkscape:connector-curvature="0"
         style="clip-rule:evenodd" /></clipPath><clipPath
       clipPathUnits="userSpaceOnUse"
       id="clipPath1142"><path
         d="M 8.871e-6,0 H 595.32001 V 842.04 H 8.871e-6 Z"
         id="path1140"
         inkscape:connector-curvature="0"
         style="clip-rule:evenodd" /></clipPath><clipPath
       clipPathUnits="userSpaceOnUse"
       id="clipPath1154"><path
         d="M 8.871e-6,0 H 595.32001 V 842.04 H 8.871e-6 Z"
         id="path1152"
         inkscape:connector-curvature="0"
         style="clip-rule:evenodd" /></clipPath><clipPath
       clipPathUnits="userSpaceOnUse"
       id="clipPath1162"><path
         d="M 8.871e-6,0 H 595.32001 V 842.04 H 8.871e-6 Z"
         id="path1160"
         inkscape:connector-curvature="0"
         style="clip-rule:evenodd" /></clipPath><clipPath
       clipPathUnits="userSpaceOnUse"
       id="clipPath1174"><path
         d="M 8.871e-6,0 H 595.32001 V 842.04 H 8.871e-6 Z"
         id="path1172"
         inkscape:connector-curvature="0"
         style="clip-rule:evenodd" /></clipPath><clipPath
       clipPathUnits="userSpaceOnUse"
       id="clipPath1186"><path
         d="M 8.871e-6,0 H 595.32001 V 842.04 H 8.871e-6 Z"
         id="path1184"
         inkscape:connector-curvature="0"
         style="clip-rule:evenodd" /></clipPath><clipPath
       clipPathUnits="userSpaceOnUse"
       id="clipPath1194"><path
         d="M 8.871e-6,0 H 595.32001 V 842.04 H 8.871e-6 Z"
         id="path1192"
         inkscape:connector-curvature="0"
         style="clip-rule:evenodd" /></clipPath><clipPath
       clipPathUnits="userSpaceOnUse"
       id="clipPath1206"><path
         d="M 8.871e-6,0 H 595.32001 V 842.04 H 8.871e-6 Z"
         id="path1204"
         inkscape:connector-curvature="0"
         style="clip-rule:evenodd" /></clipPath><clipPath
       clipPathUnits="userSpaceOnUse"
       id="clipPath1214"><path
         d="M 8.871e-6,0 H 595.32001 V 842.04 H 8.871e-6 Z"
         id="path1212"
         inkscape:connector-curvature="0"
         style="clip-rule:evenodd" /></clipPath><clipPath
       clipPathUnits="userSpaceOnUse"
       id="clipPath1226"><path
         d="M 8.871e-6,0 H 595.32001 V 842.04 H 8.871e-6 Z"
         id="path1224"
         inkscape:connector-curvature="0"
         style="clip-rule:evenodd" /></clipPath><clipPath
       clipPathUnits="userSpaceOnUse"
       id="clipPath1238"><path
         d="M 8.871e-6,0 H 595.32001 V 842.04 H 8.871e-6 Z"
         id="path1236"
         inkscape:connector-curvature="0"
         style="clip-rule:evenodd" /></clipPath><clipPath
       clipPathUnits="userSpaceOnUse"
       id="clipPath1246"><path
         d="M 8.871e-6,0 H 595.32001 V 842.04 H 8.871e-6 Z"
         id="path1244"
         inkscape:connector-curvature="0"
         style="clip-rule:evenodd" /></clipPath><clipPath
       clipPathUnits="userSpaceOnUse"
       id="clipPath1258"><path
         d="M 8.871e-6,0 H 595.32001 V 842.04 H 8.871e-6 Z"
         id="path1256"
         inkscape:connector-curvature="0"
         style="clip-rule:evenodd" /></clipPath><clipPath
       clipPathUnits="userSpaceOnUse"
       id="clipPath1318"><path
         d="M -1.5259e-5,1.8311e-4 H 595.31998 V 842.04018 H -1.5259e-5 Z"
         id="path1316"
         inkscape:connector-curvature="0"
         style="clip-rule:evenodd" /></clipPath><mask
       maskUnits="userSpaceOnUse"
       x="0"
       y="0"
       width="1"
       height="1"
       id="mask1322"><image
         width="1"
         height="1"
         style="image-rendering:optimizeSpeed"
         preserveAspectRatio="none"
         xlink:href="data:image/png;base64,iVBORw0KGgoAAAANSUhEUgAAAD4AAAAkCAAAAAD059ZlAAAAAXNCSVQI5gpbmQAAABlJREFUSIljYBgFo2AUjIJRMApGwSgYPgAACNwAAYvbBLMAAAAASUVORK5CYII="
         id="image1324" /></mask><clipPath
       clipPathUnits="userSpaceOnUse"
       id="clipPath1334"><path
         d="m 329.88,680.04 h 22.44 v 13.32 h -22.44 z"
         id="path1332"
         inkscape:connector-curvature="0"
         style="clip-rule:evenodd" /></clipPath><clipPath
       clipPathUnits="userSpaceOnUse"
       id="clipPath1346"><path
         d="m 329.88,680.04 h 22.44 v 13.32 h -22.44 z"
         id="path1344"
         inkscape:connector-curvature="0"
         style="clip-rule:evenodd" /></clipPath><clipPath
       clipPathUnits="userSpaceOnUse"
       id="clipPath1362"><path
         d="M -1.5259e-5,1.8311e-4 H 595.31998 V 842.04018 H -1.5259e-5 Z"
         id="path1360"
         inkscape:connector-curvature="0"
         style="clip-rule:evenodd" /></clipPath><mask
       maskUnits="userSpaceOnUse"
       x="0"
       y="0"
       width="1"
       height="1"
       id="mask1366"><image
         width="1"
         height="1"
         style="image-rendering:optimizeSpeed"
         preserveAspectRatio="none"
         xlink:href="data:image/png;base64,iVBORw0KGgoAAAANSUhEUgAAAD4AAAAlCAAAAAA/uwXAAAAAAXNCSVQI5gpbmQAAABlJREFUSIntwTEBAAAAwqD1T+1jDKAAALgBCRsAAY0X0cYAAAAASUVORK5CYII="
         id="image1368" /></mask><clipPath
       clipPathUnits="userSpaceOnUse"
       id="clipPath1378"><path
         d="m 424.08,538.32 h 22.44 v 13.44 h -22.44 z"
         id="path1376"
         inkscape:connector-curvature="0"
         style="clip-rule:evenodd" /></clipPath><clipPath
       clipPathUnits="userSpaceOnUse"
       id="clipPath1390"><path
         d="m 424.08,538.32 h 22.44 v 13.44 h -22.44 z"
         id="path1388"
         inkscape:connector-curvature="0"
         style="clip-rule:evenodd" /></clipPath><clipPath
       clipPathUnits="userSpaceOnUse"
       id="clipPath1398"><path
         d="M -1.5259e-5,2.4414e-4 H 595.31998 V 842.04024 H -1.5259e-5 Z"
         id="path1396"
         inkscape:connector-curvature="0"
         style="clip-rule:evenodd" /></clipPath><mask
       maskUnits="userSpaceOnUse"
       x="0"
       y="0"
       width="1"
       height="1"
       id="mask1402"><image
         width="1"
         height="1"
         style="image-rendering:optimizeSpeed"
         preserveAspectRatio="none"
         xlink:href="data:image/png;base64,iVBORw0KGgoAAAANSUhEUgAAAD4AAAAkCAAAAAD059ZlAAAAAXNCSVQI5gpbmQAAABlJREFUSIljYBgFo2AUjIJRMApGwSgYPgAACNwAAYvbBLMAAAAASUVORK5CYII="
         id="image1404" /></mask><clipPath
       clipPathUnits="userSpaceOnUse"
       id="clipPath1414"><path
         d="m 386.28,571.68 h 22.44 V 585 h -22.44 z"
         id="path1412"
         inkscape:connector-curvature="0"
         style="clip-rule:evenodd" /></clipPath><clipPath
       clipPathUnits="userSpaceOnUse"
       id="clipPath1426"><path
         d="m 386.28,571.68 h 22.44 V 585 h -22.44 z"
         id="path1424"
         inkscape:connector-curvature="0"
         style="clip-rule:evenodd" /></clipPath><clipPath
       clipPathUnits="userSpaceOnUse"
       id="clipPath1434"><path
         d="M -1.5259e-5,1.2207e-4 H 595.31998 V 842.04012 H -1.5259e-5 Z"
         id="path1432"
         inkscape:connector-curvature="0"
         style="clip-rule:evenodd" /></clipPath><mask
       maskUnits="userSpaceOnUse"
       x="0"
       y="0"
       width="1"
       height="1"
       id="mask1438"><image
         width="1"
         height="1"
         style="image-rendering:optimizeSpeed"
         preserveAspectRatio="none"
         xlink:href="data:image/png;base64,iVBORw0KGgoAAAANSUhEUgAAAD0AAAAkCAAAAAAf0G1mAAAAAXNCSVQI5gpbmQAAABlJREFUSIljYBgFo2AUjIJRMApGwSgYGgAACLgAAf/3esAAAAAASUVORK5CYII="
         id="image1440" /></mask><clipPath
       clipPathUnits="userSpaceOnUse"
       id="clipPath1450"><path
         d="m 360.24,613.2 h 22.32 v 13.32 h -22.32 z"
         id="path1448"
         inkscape:connector-curvature="0"
         style="clip-rule:evenodd" /></clipPath><clipPath
       clipPathUnits="userSpaceOnUse"
       id="clipPath1462"><path
         d="m 360.24,613.2 h 22.32 v 13.32 h -22.32 z"
         id="path1460"
         inkscape:connector-curvature="0"
         style="clip-rule:evenodd" /></clipPath><clipPath
       clipPathUnits="userSpaceOnUse"
       id="clipPath1470"><path
         d="M -1.5259e-5,1.2207e-4 H 595.31998 V 842.04012 H -1.5259e-5 Z"
         id="path1468"
         inkscape:connector-curvature="0"
         style="clip-rule:evenodd" /></clipPath><mask
       maskUnits="userSpaceOnUse"
       x="0"
       y="0"
       width="1"
       height="1"
       id="mask1474"><image
         width="1"
         height="1"
         style="image-rendering:optimizeSpeed"
         preserveAspectRatio="none"
         xlink:href="data:image/png;base64,iVBORw0KGgoAAAANSUhEUgAAAD0AAAAlCAAAAADUjL7DAAAAAXNCSVQI5gpbmQAAABhJREFUSIntwQEBAAAAgiD/r25IQAEAPBgI9gAByA8t1AAAAABJRU5ErkJggg=="
         id="image1476" /></mask><clipPath
       clipPathUnits="userSpaceOnUse"
       id="clipPath1486"><path
         d="m 341.04,648.96 h 22.32 v 13.44 h -22.32 z"
         id="path1484"
         inkscape:connector-curvature="0"
         style="clip-rule:evenodd" /></clipPath><clipPath
       clipPathUnits="userSpaceOnUse"
       id="clipPath1498"><path
         d="m 341.04,648.96 h 22.32 v 13.44 h -22.32 z"
         id="path1496"
         inkscape:connector-curvature="0"
         style="clip-rule:evenodd" /></clipPath><clipPath
       clipPathUnits="userSpaceOnUse"
       id="clipPath1506"><path
         d="M -1.5259e-5,1.2207e-4 H 595.31998 V 842.04012 H -1.5259e-5 Z"
         id="path1504"
         inkscape:connector-curvature="0"
         style="clip-rule:evenodd" /></clipPath><mask
       maskUnits="userSpaceOnUse"
       x="0"
       y="0"
       width="1"
       height="1"
       id="mask1510"><image
         width="1"
         height="1"
         style="image-rendering:optimizeSpeed"
         preserveAspectRatio="none"
         xlink:href="data:image/png;base64,iVBORw0KGgoAAAANSUhEUgAAAD4AAAAlCAAAAAA/uwXAAAAAAXNCSVQI5gpbmQAAABlJREFUSIntwTEBAAAAwqD1T+1jDKAAALgBCRsAAY0X0cYAAAAASUVORK5CYII="
         id="image1512" /></mask><clipPath
       clipPathUnits="userSpaceOnUse"
       id="clipPath1522"><path
         d="m 314.64,715.68 h 22.44 v 13.44 h -22.44 z"
         id="path1520"
         inkscape:connector-curvature="0"
         style="clip-rule:evenodd" /></clipPath><clipPath
       clipPathUnits="userSpaceOnUse"
       id="clipPath1534"><path
         d="m 314.64,715.68 h 22.44 v 13.44 h -22.44 z"
         id="path1532"
         inkscape:connector-curvature="0"
         style="clip-rule:evenodd" /></clipPath><clipPath
       clipPathUnits="userSpaceOnUse"
       id="clipPath1542"><path
         d="M -1.5259e-5,1.2207e-4 H 595.31998 V 842.04012 H -1.5259e-5 Z"
         id="path1540"
         inkscape:connector-curvature="0"
         style="clip-rule:evenodd" /></clipPath><mask
       maskUnits="userSpaceOnUse"
       x="0"
       y="0"
       width="1"
       height="1"
       id="mask1546"><image
         width="1"
         height="1"
         style="image-rendering:optimizeSpeed"
         preserveAspectRatio="none"
         xlink:href="data:image/png;base64,iVBORw0KGgoAAAANSUhEUgAAAD4AAAAkCAAAAAD059ZlAAAAAXNCSVQI5gpbmQAAABlJREFUSIljYBgFo2AUjIJRMApGwSgYPgAACNwAAYvbBLMAAAAASUVORK5CYII="
         id="image1548" /></mask><clipPath
       clipPathUnits="userSpaceOnUse"
       id="clipPath1558"><path
         d="m 306.36,748.32 h 22.44 v 13.32 h -22.44 z"
         id="path1556"
         inkscape:connector-curvature="0"
         style="clip-rule:evenodd" /></clipPath><clipPath
       clipPathUnits="userSpaceOnUse"
       id="clipPath1570"><path
         d="m 306.36,748.32 h 22.44 v 13.32 h -22.44 z"
         id="path1568"
         inkscape:connector-curvature="0"
         style="clip-rule:evenodd" /></clipPath><clipPath
       clipPathUnits="userSpaceOnUse"
       id="clipPath1578"><path
         d="M -1.5259e-5,1.2207e-4 H 595.31998 V 842.04012 H -1.5259e-5 Z"
         id="path1576"
         inkscape:connector-curvature="0"
         style="clip-rule:evenodd" /></clipPath><mask
       maskUnits="userSpaceOnUse"
       x="0"
       y="0"
       width="1"
       height="1"
       id="mask1582"><image
         width="1"
         height="1"
         style="image-rendering:optimizeSpeed"
         preserveAspectRatio="none"
         xlink:href="data:image/png;base64,iVBORw0KGgoAAAANSUhEUgAAAD4AAAAkCAAAAAD059ZlAAAAAXNCSVQI5gpbmQAAABlJREFUSIljYBgFo2AUjIJRMApGwSgYPgAACNwAAYvbBLMAAAAASUVORK5CYII="
         id="image1584" /></mask><clipPath
       clipPathUnits="userSpaceOnUse"
       id="clipPath1594"><path
         d="m 279,770.04 h 22.44 v 13.2 H 279 Z"
         id="path1592"
         inkscape:connector-curvature="0"
         style="clip-rule:evenodd" /></clipPath><clipPath
       clipPathUnits="userSpaceOnUse"
       id="clipPath1606"><path
         d="m 279,770.04 h 22.44 v 13.2 H 279 Z"
         id="path1604"
         inkscape:connector-curvature="0"
         style="clip-rule:evenodd" /></clipPath><clipPath
       clipPathUnits="userSpaceOnUse"
       id="clipPath1614"><path
         d="M -1.5259e-5,1.2207e-4 H 595.31998 V 842.04012 H -1.5259e-5 Z"
         id="path1612"
         inkscape:connector-curvature="0"
         style="clip-rule:evenodd" /></clipPath><mask
       maskUnits="userSpaceOnUse"
       x="0"
       y="0"
       width="1"
       height="1"
       id="mask1618"><image
         width="1"
         height="1"
         style="image-rendering:optimizeSpeed"
         preserveAspectRatio="none"
         xlink:href="data:image/png;base64,iVBORw0KGgoAAAANSUhEUgAAAD4AAAAkCAAAAAD059ZlAAAAAXNCSVQI5gpbmQAAABlJREFUSIljYBgFo2AUjIJRMApGwSgYPgAACNwAAYvbBLMAAAAASUVORK5CYII="
         id="image1620" /></mask><clipPath
       clipPathUnits="userSpaceOnUse"
       id="clipPath1630"><path
         d="m 243,770.04 h 22.44 v 13.2 H 243 Z"
         id="path1628"
         inkscape:connector-curvature="0"
         style="clip-rule:evenodd" /></clipPath><clipPath
       clipPathUnits="userSpaceOnUse"
       id="clipPath1642"><path
         d="m 243,770.04 h 22.44 v 13.2 H 243 Z"
         id="path1640"
         inkscape:connector-curvature="0"
         style="clip-rule:evenodd" /></clipPath><clipPath
       clipPathUnits="userSpaceOnUse"
       id="clipPath1650"><path
         d="M -1.5259e-5,1.2207e-4 H 595.31998 V 842.04012 H -1.5259e-5 Z"
         id="path1648"
         inkscape:connector-curvature="0"
         style="clip-rule:evenodd" /></clipPath><mask
       maskUnits="userSpaceOnUse"
       x="0"
       y="0"
       width="1"
       height="1"
       id="mask1654"><image
         width="1"
         height="1"
         style="image-rendering:optimizeSpeed"
         preserveAspectRatio="none"
         xlink:href="data:image/png;base64,iVBORw0KGgoAAAANSUhEUgAAAFYAAAAkCAAAAAA215LhAAAAAXNCSVQI5gpbmQAAABpJREFUSIntwYEAAAAAw6D5Ux/hAlUBAAB8Aww8AAH6oFqvAAAAAElFTkSuQmCC"
         id="image1656" /></mask><clipPath
       clipPathUnits="userSpaceOnUse"
       id="clipPath1666"><path
         d="m 207.48,748.68 h 31.08 V 762 h -31.08 z"
         id="path1664"
         inkscape:connector-curvature="0"
         style="clip-rule:evenodd" /></clipPath><clipPath
       clipPathUnits="userSpaceOnUse"
       id="clipPath1678"><path
         d="m 207.48,748.68 h 31.08 V 762 h -31.08 z"
         id="path1676"
         inkscape:connector-curvature="0"
         style="clip-rule:evenodd" /></clipPath><clipPath
       clipPathUnits="userSpaceOnUse"
       id="clipPath1686"><path
         d="M -1.5259e-5,1.2207e-4 H 595.31998 V 842.04012 H -1.5259e-5 Z"
         id="path1684"
         inkscape:connector-curvature="0"
         style="clip-rule:evenodd" /></clipPath><mask
       maskUnits="userSpaceOnUse"
       x="0"
       y="0"
       width="1"
       height="1"
       id="mask1690"><image
         width="1"
         height="1"
         style="image-rendering:optimizeSpeed"
         preserveAspectRatio="none"
         xlink:href="data:image/png;base64,iVBORw0KGgoAAAANSUhEUgAAAFYAAAAkCAAAAAA215LhAAAAAXNCSVQI5gpbmQAAABpJREFUSIntwYEAAAAAw6D5Ux/hAlUBAAB8Aww8AAH6oFqvAAAAAElFTkSuQmCC"
         id="image1692" /></mask><clipPath
       clipPathUnits="userSpaceOnUse"
       id="clipPath1702"><path
         d="m 194.04,720.12 h 31.08 v 13.32 h -31.08 z"
         id="path1700"
         inkscape:connector-curvature="0"
         style="clip-rule:evenodd" /></clipPath><clipPath
       clipPathUnits="userSpaceOnUse"
       id="clipPath1714"><path
         d="m 194.04,720.12 h 31.08 v 13.32 h -31.08 z"
         id="path1712"
         inkscape:connector-curvature="0"
         style="clip-rule:evenodd" /></clipPath><clipPath
       clipPathUnits="userSpaceOnUse"
       id="clipPath1722"><path
         d="M -1.5259e-5,1.2207e-4 H 595.31998 V 842.04012 H -1.5259e-5 Z"
         id="path1720"
         inkscape:connector-curvature="0"
         style="clip-rule:evenodd" /></clipPath><mask
       maskUnits="userSpaceOnUse"
       x="0"
       y="0"
       width="1"
       height="1"
       id="mask1726"><image
         width="1"
         height="1"
         style="image-rendering:optimizeSpeed"
         preserveAspectRatio="none"
         xlink:href="data:image/png;base64,iVBORw0KGgoAAAANSUhEUgAAAFcAAAAkCAAAAADZFfnfAAAAAXNCSVQI5gpbmQAAABpJREFUSIntwTEBAAAAwqD1T20JT6AAAAA+BgxgAAECzsf2AAAAAElFTkSuQmCC"
         id="image1728" /></mask><clipPath
       clipPathUnits="userSpaceOnUse"
       id="clipPath1738"><path
         d="m 178.2,681 h 31.56 v 13.32 H 178.2 Z"
         id="path1736"
         inkscape:connector-curvature="0"
         style="clip-rule:evenodd" /></clipPath><clipPath
       clipPathUnits="userSpaceOnUse"
       id="clipPath1750"><path
         d="m 178.2,681 h 31.56 v 13.32 H 178.2 Z"
         id="path1748"
         inkscape:connector-curvature="0"
         style="clip-rule:evenodd" /></clipPath><clipPath
       clipPathUnits="userSpaceOnUse"
       id="clipPath1758"><path
         d="M -1.5259e-5,1.8311e-4 H 595.31998 V 842.04018 H -1.5259e-5 Z"
         id="path1756"
         inkscape:connector-curvature="0"
         style="clip-rule:evenodd" /></clipPath><mask
       maskUnits="userSpaceOnUse"
       x="0"
       y="0"
       width="1"
       height="1"
       id="mask1762"><image
         width="1"
         height="1"
         style="image-rendering:optimizeSpeed"
         preserveAspectRatio="none"
         xlink:href="data:image/png;base64,iVBORw0KGgoAAAANSUhEUgAAAFQAAAAkCAAAAAAyIkLcAAAAAXNCSVQI5gpbmQAAABlJREFUSIntwQENAAAAwqD3T20PBxQAAPBsC/QAAT4ceiYAAAAASUVORK5CYII="
         id="image1764" /></mask><clipPath
       clipPathUnits="userSpaceOnUse"
       id="clipPath1774"><path
         d="m 166.56,644.76 h 30.6 v 13.32 h -30.6 z"
         id="path1772"
         inkscape:connector-curvature="0"
         style="clip-rule:evenodd" /></clipPath><clipPath
       clipPathUnits="userSpaceOnUse"
       id="clipPath1786"><path
         d="m 166.56,644.76 h 30.6 v 13.32 h -30.6 z"
         id="path1784"
         inkscape:connector-curvature="0"
         style="clip-rule:evenodd" /></clipPath><clipPath
       clipPathUnits="userSpaceOnUse"
       id="clipPath1794"><path
         d="M -1.5259e-5,1.8311e-4 H 595.31998 V 842.04018 H -1.5259e-5 Z"
         id="path1792"
         inkscape:connector-curvature="0"
         style="clip-rule:evenodd" /></clipPath><mask
       maskUnits="userSpaceOnUse"
       x="0"
       y="0"
       width="1"
       height="1"
       id="mask1798"><image
         width="1"
         height="1"
         style="image-rendering:optimizeSpeed"
         preserveAspectRatio="none"
         xlink:href="data:image/png;base64,iVBORw0KGgoAAAANSUhEUgAAAFMAAAAkCAAAAADQ/lmlAAAAAXNCSVQI5gpbmQAAABpJREFUSIntwQENAAAAwqD3T20ON6AAAIBXAwvQAAG71gSoAAAAAElFTkSuQmCC"
         id="image1800" /></mask><clipPath
       clipPathUnits="userSpaceOnUse"
       id="clipPath1810"><path
         d="m 155.52,593.4 h 30.12 v 13.44 h -30.12 z"
         id="path1808"
         inkscape:connector-curvature="0"
         style="clip-rule:evenodd" /></clipPath><clipPath
       clipPathUnits="userSpaceOnUse"
       id="clipPath1822"><path
         d="m 155.52,593.4 h 30.12 v 13.44 h -30.12 z"
         id="path1820"
         inkscape:connector-curvature="0"
         style="clip-rule:evenodd" /></clipPath><clipPath
       clipPathUnits="userSpaceOnUse"
       id="clipPath1830"><path
         d="M -1.5259e-5,2.4414e-4 H 595.31998 V 842.04024 H -1.5259e-5 Z"
         id="path1828"
         inkscape:connector-curvature="0"
         style="clip-rule:evenodd" /></clipPath><mask
       maskUnits="userSpaceOnUse"
       x="0"
       y="0"
       width="1"
       height="1"
       id="mask1834"><image
         width="1"
         height="1"
         style="image-rendering:optimizeSpeed"
         preserveAspectRatio="none"
         xlink:href="data:image/png;base64,iVBORw0KGgoAAAANSUhEUgAAAF4AAAAkCAAAAAAlANIVAAAAAXNCSVQI5gpbmQAAABpJREFUSIntwTEBAAAAwqD1T20IX6AAAAB4DQ1cAAEMgeyjAAAAAElFTkSuQmCC"
         id="image1836" /></mask><clipPath
       clipPathUnits="userSpaceOnUse"
       id="clipPath1846"><path
         d="m 148.8,545.76 h 33.84 V 559.2 H 148.8 Z"
         id="path1844"
         inkscape:connector-curvature="0"
         style="clip-rule:evenodd" /></clipPath><clipPath
       clipPathUnits="userSpaceOnUse"
       id="clipPath1858"><path
         d="m 148.8,545.76 h 33.84 V 559.2 H 148.8 Z"
         id="path1856"
         inkscape:connector-curvature="0"
         style="clip-rule:evenodd" /></clipPath></defs><sodipodi:namedview
     pagecolor="#ffffff"
     bordercolor="#666666"
     borderopacity="1"
     objecttolerance="10"
     gridtolerance="10"
     guidetolerance="10"
     inkscape:pageopacity="0"
     inkscape:pageshadow="2"
     inkscape:window-width="1680"
     inkscape:window-height="995"
     id="namedview4"
     showgrid="true"
     units="mm"
     fit-margin-top="5"
     fit-margin-left="5"
     fit-margin-right="5"
     fit-margin-bottom="5"
     inkscape:zoom="1.0125375"
     inkscape:cx="126.41507"
     inkscape:cy="377.7638"
     inkscape:window-x="0"
     inkscape:window-y="0"
     inkscape:window-maximized="1"
     inkscape:current-layer="g10"
     inkscape:document-units="mm"
     showguides="true"
     inkscape:guide-bbox="true"
     showborder="true"
     inkscape:snap-intersection-paths="true"
     inkscape:snap-global="true"
     inkscape:snap-object-midpoints="true"
     inkscape:snap-bbox="false"
     inkscape:snap-bbox-edge-midpoints="true"
     inkscape:snap-center="true"
     inkscape:snap-grids="true"
     inkscape:snap-page="false"
     inkscape:document-rotation="0"
     inkscape:snap-nodes="true"
     inkscape:snap-to-guides="false"><inkscape:grid
       type="xygrid"
       id="grid627"
       units="mm"
       spacingx="3.7795278"
       spacingy="3.7795278"
       originx="188.78742"
       originy="188.78744" /></sodipodi:namedview><g
     id="g10"
     inkscape:groupmode="layer"
     inkscape:label="MECA1_ACT"
     transform="matrix(1.3333333,0,0,-1.3333333,-5.8330409,1277.3073)"><g
       id="g36"><g
         id="g38"
         clip-path="url(#clipPath42)" /></g><g
       id="g68"><g
         id="g70"
         clip-path="url(#clipPath74)" /></g><g
       id="g88"><g
         id="g90"
         clip-path="url(#clipPath94)" /></g><g
       id="g108"><g
         id="g110"
         clip-path="url(#clipPath114)" /></g><g
       id="g116"><g
         id="g118"
         clip-path="url(#clipPath122)" /></g><g
       id="g136"><g
         id="g138"
         clip-path="url(#clipPath142)" /></g><g
       id="g180"><g
         id="g182"
         clip-path="url(#clipPath186)" /></g><g
       id="g188"><g
         id="g190"
         clip-path="url(#clipPath194)" /></g><g
       id="g208"><g
         id="g210"
         clip-path="url(#clipPath214)" /></g><g
       id="g228"><g
         id="g230"
         clip-path="url(#clipPath234)" /></g><g
       id="g248"><g
         id="g250"
         clip-path="url(#clipPath254)"><text
   transform="matrix(1,0,0,-1,337.63,497.83)"
   style="font-style:normal;font-variant:normal;font-weight:normal;font-stretch:normal;font-size:11.04px;font-family:'Skarpa Regular';-inkscape-font-specification:'Skarpa Regular, ';writing-mode:lr-tb;fill:#000000;fill-opacity:1;fill-rule:nonzero;stroke:none"
   id="text258"><tspan
     x="0"
     y="0"
     id="tspan256"
     style="font-style:normal;font-variant:normal;font-weight:normal;font-stretch:normal;font-family:'Skarpa Regular';-inkscape-font-specification:'Skarpa Regular, '">푣</tspan></text>

</g></g><g
       id="g308"><g
         id="g310"
         clip-path="url(#clipPath314)" /></g><g
       id="g328"><g
         id="g330"
         clip-path="url(#clipPath334)" /></g><g
       id="g360"><g
         id="g362"
         clip-path="url(#clipPath366)" /></g><g
       id="g380"><g
         id="g382"
         clip-path="url(#clipPath386)" /></g><g
       id="g400"><g
         id="g402"
         clip-path="url(#clipPath406)"><text
   transform="matrix(1,0,0,-1,243.29,468.43)"
   style="font-style:normal;font-variant:normal;font-weight:normal;font-stretch:normal;font-size:11.04px;font-family:'Skarpa Regular';-inkscape-font-specification:'Skarpa Regular, ';writing-mode:lr-tb;fill:#000000;fill-opacity:1;fill-rule:nonzero;stroke:none"
   id="text410"><tspan
     x="0"
     y="0"
     id="tspan408"
     style="font-style:normal;font-variant:normal;font-weight:normal;font-stretch:normal;font-family:'Skarpa Regular';-inkscape-font-specification:'Skarpa Regular, '">푣</tspan></text>

</g></g><g
       id="g460"><g
         id="g462"
         clip-path="url(#clipPath466)" /></g><g
       id="g516"><g
         id="g518"
         clip-path="url(#clipPath522)" /></g><g
       id="g536"><g
         id="g538"
         clip-path="url(#clipPath542)" /></g><g
       id="g592"><g
         id="g594"
         clip-path="url(#clipPath598)" /></g><g
       id="g612"><g
         id="g614"
         clip-path="url(#clipPath618)" /></g><g
       id="g644"><g
         id="g646"
         clip-path="url(#clipPath650)" /></g><g
       id="g664"><g
         id="g666"
         clip-path="url(#clipPath670)"><text
   transform="matrix(1,0,0,-1,420.94,439.03)"
   style="font-style:normal;font-variant:normal;font-weight:normal;font-stretch:normal;font-size:11.04px;font-family:'Skarpa Regular';-inkscape-font-specification:'Skarpa Regular, ';writing-mode:lr-tb;fill:#000000;fill-opacity:1;fill-rule:nonzero;stroke:none"
   id="text674"><tspan
     x="0"
     y="0"
     id="tspan672"
     style="font-style:normal;font-variant:normal;font-weight:normal;font-stretch:normal;font-family:'Skarpa Regular';-inkscape-font-specification:'Skarpa Regular, '">푣</tspan></text>

</g></g><g
       id="g724"><g
         id="g726"
         clip-path="url(#clipPath730)" /></g><g
       id="g744"><g
         id="g746"
         clip-path="url(#clipPath750)" /></g><g
       id="g776"><g
         id="g778"
         clip-path="url(#clipPath782)" /></g><g
       id="g796"><g
         id="g798"
         clip-path="url(#clipPath802)" /></g><g
       id="g804"><g
         id="g806"
         clip-path="url(#clipPath810)"><text
   transform="matrix(1,0,0,-1,427.06,424.25)"
   style="font-style:normal;font-variant:normal;font-weight:normal;font-stretch:normal;font-size:11.04px;font-family:'Skarpa Regular';-inkscape-font-specification:'Skarpa Regular, ';writing-mode:lr-tb;fill:#000000;fill-opacity:1;fill-rule:nonzero;stroke:none"
   id="text814"><tspan
     x="0"
     y="0"
     id="tspan812"
     style="font-style:normal;font-variant:normal;font-weight:normal;font-stretch:normal;font-family:'Skarpa Regular';-inkscape-font-specification:'Skarpa Regular, '">푣</tspan></text>

</g></g><g
       id="g876"><g
         id="g878"
         clip-path="url(#clipPath882)" /></g><g
       id="g896"><g
         id="g898"
         clip-path="url(#clipPath902)" /></g><g
       id="g916"><g
         id="g918"
         clip-path="url(#clipPath922)" /></g><g
       id="g936"><g
         id="g938"
         clip-path="url(#clipPath942)" /></g><g
       id="g1028"><g
         id="g1030"
         clip-path="url(#clipPath1034)" /></g><g
       id="g1108"><g
         id="g1110"
         clip-path="url(#clipPath1114)" /></g><g
       id="g1116"><g
         id="g1118"
         clip-path="url(#clipPath1122)" /></g><g
       id="g1148"><g
         id="g1150"
         clip-path="url(#clipPath1154)" /></g><g
       id="g1180"><g
         id="g1182"
         clip-path="url(#clipPath1186)" /></g><g
       id="g1200"><g
         id="g1202"
         clip-path="url(#clipPath1206)" /></g><g
       id="g1232"><g
         id="g1234"
         clip-path="url(#clipPath1238)" /></g><g
       id="g1252"><g
         id="g1254"
         clip-path="url(#clipPath1258)" /></g><g
       id="g1340"><g
         id="g1342"
         clip-path="url(#clipPath1346)" /></g><g
       id="g1384"><g
         id="g1386"
         clip-path="url(#clipPath1390)" /></g><g
       id="g1420"><g
         id="g1422"
         clip-path="url(#clipPath1426)" /></g><g
       id="g1456"><g
         id="g1458"
         clip-path="url(#clipPath1462)" /></g><g
       id="g1492"><g
         id="g1494"
         clip-path="url(#clipPath1498)" /></g><g
       id="g1528"><g
         id="g1530"
         clip-path="url(#clipPath1534)" /></g><g
       id="g1564"><g
         id="g1566"
         clip-path="url(#clipPath1570)" /></g><g
       id="g1600"><g
         id="g1602"
         clip-path="url(#clipPath1606)" /></g><g
       id="g1636"><g
         id="g1638"
         clip-path="url(#clipPath1642)" /></g><g
       id="g1672"><g
         id="g1674"
         clip-path="url(#clipPath1678)" /></g><g
       id="g1708"><g
         id="g1710"
         clip-path="url(#clipPath1714)" /></g><g
       id="g1744"><g
         id="g1746"
         clip-path="url(#clipPath1750)" /></g><g
       id="g1780"><g
         id="g1782"
         clip-path="url(#clipPath1786)" /></g><rect
       transform="scale(1,-1)"
       y="-957.98053"
       x="4.3747659"
       height="566.64575"
       width="566.64575"
       id="rect6295"
       style="fill:#ffffff;stroke:none;stroke-width:0.46771657;stroke-miterlimit:4;stroke-dasharray:none" /><g
       transform="rotate(82.5,287.69766,674.65765)"
       id="g813"><ellipse
         id="path4337"
         cx="287.69766"
         cy="-674.65765"
         transform="scale(1,-1)"
         style="fill:none;stroke:#000000;stroke-width:0.751181;stroke-miterlimit:4;stroke-dasharray:none"
         rx="226.77168"
         ry="226.77167" /><g
         id="g4365"
         transform="matrix(2.566361,0,0,2.566361,-450.00339,-1226.5552)"
         style="stroke-width:0.292703;stroke-miterlimit:4;stroke-dasharray:none"><ellipse
           style="fill:none;stroke:#000000;stroke-width:0.292703;stroke-miterlimit:4;stroke-dasharray:none"
           id="ellipse4345"
           cx="-88.184715"
           cy="-853.86047"
           transform="matrix(0.90378292,-0.42799116,-0.42799116,-0.90378292,0,0)"
           rx="19.842531"
           ry="6.6141772" /><ellipse
           ry="6.6141772"
           rx="19.842531"
           transform="rotate(-154.65986)"
           cy="-607.87494"
           cx="-607.62891"
           id="ellipse4347"
           style="fill:#ffffff;stroke:#000000;stroke-width:0.292703;stroke-miterlimit:4;stroke-dasharray:none" /><ellipse
           ry="8.5039377"
           rx="2.8346462"
           transform="scale(1,-1)"
           cy="-810.65076"
           cx="270.75296"
           id="path4349"
           style="fill:#ffffff;stroke:#000000;stroke-width:0.292703;stroke-miterlimit:4;stroke-dasharray:none" /><ellipse
           ry="2.8346462"
           rx="8.5039377"
           transform="matrix(0.84287895,-0.53810323,-0.53810323,-0.84287895,0,0)"
           cy="-823.26483"
           cx="-197.88864"
           id="path4351"
           style="fill:#ffffff;stroke:#000000;stroke-width:0.292703;stroke-miterlimit:4;stroke-dasharray:none" /><ellipse
           style="fill:#ffffff;stroke:#000000;stroke-width:0.292703;stroke-miterlimit:4;stroke-dasharray:none"
           id="ellipse4353"
           cx="-304.78372"
           cy="-811.30164"
           transform="scale(-1)"
           rx="2.8346462"
           ry="8.5039377" /><ellipse
           ry="6.6141772"
           rx="19.842531"
           transform="scale(1,-1)"
           cy="-816.38995"
           cx="287.69766"
           id="path4343"
           style="fill:#ffffff;stroke:#000000;stroke-width:0.292703;stroke-miterlimit:4;stroke-dasharray:none" /><ellipse
           style="fill:#ffffff;stroke:#000000;stroke-width:0.292703;stroke-miterlimit:4;stroke-dasharray:none"
           id="ellipse4355"
           cx="-683.34668"
           cy="-514.1153"
           transform="rotate(-147.44539)"
           rx="8.5039377"
           ry="2.8346462" /><circle
           transform="scale(1,-1)"
           r="11.338576"
           cy="-816.38995"
           cx="287.69766"
           id="path4341"
           style="fill:#ffffff;stroke:#000000;stroke-width:0.292703;stroke-miterlimit:4;stroke-dasharray:none" /></g></g><g
       id="g1816"><g
         id="g1818"
         clip-path="url(#clipPath1822)" /></g><g
       id="g1852"><g
         id="g1854"
         clip-path="url(#clipPath1858)" /></g><circle
       transform="matrix(0.92387953,-0.38268343,-0.38268343,-0.92387953,0,0)"
       r="5.6692996"
       cy="-780.34491"
       cx="101.69547"
       id="path5174"
       style="fill:#c8beb7;stroke:#000000;stroke-width:0.751181;stroke-miterlimit:4;stroke-dasharray:none" /><g
       id="g5209"
       transform="rotate(-22.5,287.69772,674.65764)"
       inkscape:transform-center-x="-129.98104"
       inkscape:transform-center-y="-313.80202"><ellipse
         style="fill:#ff8080;stroke:#ff0000;stroke-width:0.467717;stroke-miterlimit:4;stroke-dasharray:none"
         id="path5176"
         cx="287.69766"
         cy="-922.3136"
         transform="scale(1,-1)"
         rx="1.4173231"
         ry="7.0866151" /><ellipse
         ry="7.0866151"
         rx="1.4173231"
         transform="matrix(0.80901699,0.58778525,0.58778525,-0.80901699,0,0)"
         cy="-575.70953"
         cx="779.04004"
         id="ellipse5178"
         style="fill:#ff8080;stroke:#ff0000;stroke-width:0.467717;stroke-miterlimit:4;stroke-dasharray:none"
         inkscape:transform-center-y="7.644234"
         inkscape:transform-center-x="-5.5538573" /><ellipse
         inkscape:transform-center-x="-8.9863359"
         inkscape:transform-center-y="2.9198116"
         style="fill:#ff8080;stroke:#ff0000;stroke-width:0.467717;stroke-miterlimit:4;stroke-dasharray:none"
         id="ellipse5180"
         cx="972.81561"
         cy="-6.4971304"
         transform="matrix(0.30901699,0.95105652,0.95105652,-0.30901699,0,0)"
         rx="1.4173231"
         ry="7.0866151" /><ellipse
         ry="7.0866151"
         rx="1.4173231"
         transform="matrix(-0.309017,0.95105651,0.95105651,0.309017,0,0)"
         cy="567.90381"
         cx="795.00867"
         id="ellipse5182"
         style="fill:#ff8080;stroke:#ff0000;stroke-width:0.467717;stroke-miterlimit:4;stroke-dasharray:none"
         inkscape:transform-center-y="-2.9198477"
         inkscape:transform-center-x="-8.9863448" /><ellipse
         inkscape:transform-center-x="-5.5538735"
         inkscape:transform-center-y="-7.6442414"
         style="fill:#ff8080;stroke:#ff0000;stroke-width:0.467717;stroke-miterlimit:4;stroke-dasharray:none"
         id="ellipse5184"
         cx="313.53543"
         cy="928.09161"
         transform="matrix(-0.809017,0.58778525,0.58778525,0.809017,0,0)"
         rx="1.4173231"
         ry="7.0866151" /><ellipse
         ry="7.0866151"
         rx="1.4173231"
         transform="scale(-1,1)"
         cy="936.48682"
         cx="-287.69766"
         id="ellipse5186"
         style="fill:#ff8080;stroke:#ff0000;stroke-width:0.467717;stroke-miterlimit:4;stroke-dasharray:none"
         inkscape:transform-center-y="-9.4488036" /><ellipse
         inkscape:transform-center-y="-7.6442646"
         style="fill:#ff8080;stroke:#ff0000;stroke-width:0.467717;stroke-miterlimit:4;stroke-dasharray:none"
         id="ellipse5188"
         cx="-779.04004"
         cy="589.88275"
         transform="matrix(-0.80901699,-0.58778525,-0.58778525,0.80901699,0,0)"
         rx="1.4173231"
         ry="7.0866151"
         inkscape:transform-center-x="5.5538872" /><ellipse
         inkscape:transform-center-x="8.9863711"
         ry="7.0866151"
         rx="1.4173231"
         transform="matrix(-0.30901699,-0.95105652,-0.95105652,0.30901699,0,0)"
         cy="20.670347"
         cx="-972.81561"
         id="ellipse5190"
         style="fill:#ff8080;stroke:#ff0000;stroke-width:0.467717;stroke-miterlimit:4;stroke-dasharray:none"
         inkscape:transform-center-y="-2.9198747" /><ellipse
         inkscape:transform-center-y="2.9198394"
         style="fill:#ff8080;stroke:#ff0000;stroke-width:0.467717;stroke-miterlimit:4;stroke-dasharray:none"
         id="ellipse5192"
         cx="-795.00867"
         cy="-553.73059"
         transform="matrix(0.309017,-0.95105651,-0.95105651,-0.309017,0,0)"
         rx="1.4173231"
         ry="7.0866151"
         inkscape:transform-center-x="8.9863632" /><ellipse
         inkscape:transform-center-x="5.5538709"
         ry="7.0866151"
         rx="1.4173231"
         transform="matrix(0.809017,-0.58778525,-0.58778525,-0.809017,0,0)"
         cy="-913.9184"
         cx="-313.53543"
         id="ellipse5194"
         style="fill:#ff8080;stroke:#ff0000;stroke-width:0.467717;stroke-miterlimit:4;stroke-dasharray:none"
         inkscape:transform-center-y="7.6442576" /><circle
         style="fill:#ffdd55;stroke:#aa8800;stroke-width:0.467717;stroke-miterlimit:4;stroke-dasharray:none"
         id="path5196"
         cx="287.69766"
         cy="-929.40021"
         r="2.8346431"
         transform="scale(1,-1)" /></g></g><g
     sodipodi:insensitive="true"
     style="display:none"
     inkscape:label="traj balle"
     id="layer1"
     inkscape:groupmode="layer"><circle
       style="fill:#c8beb7;stroke:#000000;stroke-width:0.751181;stroke-miterlimit:4;stroke-dasharray:none"
       id="circle503"
       cx="146.82202"
       cy="-671.40009"
       r="5.6692996"
       transform="matrix(1.2318393,0.51024454,-0.51024454,1.2318393,-5.8330406,1277.3072)" /><path
       inkscape:connector-curvature="0"
       id="path505"
       d="M 392.57954,564.10643 V 785.20881"
       style="fill:none;fill-rule:evenodd;stroke:#000000;stroke-width:0.75px;stroke-linecap:butt;stroke-linejoin:miter;stroke-opacity:1"
       transform="matrix(1.3333332,0,0,-1.3333332,-5.8330406,1277.3072)" /></g></svg>
