<?xml version="1.0" encoding="UTF-8" standalone="no"?>
<svg
   xmlns:dc="http://purl.org/dc/elements/1.1/"
   xmlns:cc="http://creativecommons.org/ns#"
   xmlns:rdf="http://www.w3.org/1999/02/22-rdf-syntax-ns#"
   xmlns:svg="http://www.w3.org/2000/svg"
   xmlns="http://www.w3.org/2000/svg"
   xmlns:sodipodi="http://sodipodi.sourceforge.net/DTD/sodipodi-0.dtd"
   xmlns:inkscape="http://www.inkscape.org/namespaces/inkscape"
   version="1.1"
   inkscape:output_extension="org.inkscape.output.svg.inkscape"
   sodipodi:docname="PythoBuild.svg"
   inkscape:version="1.0.2 (e86c870879, 2021-01-15)"
   sodipodi:version="0.32"
   id="svg2"
   height="42.549435mm"
   width="283.57971mm">
  <defs
     id="defs4">
    <marker
       inkscape:stockid="Arrow2Mend"
       orient="auto"
       refY="0"
       refX="0"
       id="marker7685"
       style="overflow:visible"
       inkscape:isstock="true">
      <path
         inkscape:connector-curvature="0"
         id="path7683"
         style="fill:#3465a4;fill-opacity:1;fill-rule:evenodd;stroke:#3465a4;stroke-width:0.625;stroke-linejoin:round;stroke-opacity:1"
         d="M 8.7185878,4.0337352 -2.2072895,0.01601326 8.7185884,-4.0017078 c -1.7454984,2.3720609 -1.7354408,5.6174519 -6e-7,8.035443 z"
         transform="scale(-0.6)" />
    </marker>
    <marker
       inkscape:collect="always"
       inkscape:stockid="Arrow2Mend"
       orient="auto"
       refY="0"
       refX="0"
       id="marker6209"
       style="overflow:visible"
       inkscape:isstock="true">
      <path
         inkscape:connector-curvature="0"
         id="path6207"
         style="fill:#3465a4;fill-opacity:1;fill-rule:evenodd;stroke:#3465a4;stroke-width:0.625;stroke-linejoin:round;stroke-opacity:1"
         d="M 8.7185878,4.0337352 -2.2072895,0.01601326 8.7185884,-4.0017078 c -1.7454984,2.3720609 -1.7354408,5.6174519 -6e-7,8.035443 z"
         transform="scale(-0.6)" />
    </marker>
    <marker
       inkscape:collect="always"
       inkscape:isstock="true"
       style="overflow:visible"
       id="marker5991"
       refX="0"
       refY="0"
       orient="auto"
       inkscape:stockid="Arrow2Mend">
      <path
         inkscape:connector-curvature="0"
         transform="scale(-0.6)"
         d="M 8.7185878,4.0337352 -2.2072895,0.01601326 8.7185884,-4.0017078 c -1.7454984,2.3720609 -1.7354408,5.6174519 -6e-7,8.035443 z"
         style="fill:#3465a4;fill-opacity:1;fill-rule:evenodd;stroke:#3465a4;stroke-width:0.625;stroke-linejoin:round;stroke-opacity:1"
         id="path5989" />
    </marker>
    <marker
       inkscape:collect="always"
       inkscape:stockid="Arrow2Mend"
       orient="auto"
       refY="0"
       refX="0"
       id="marker5781"
       style="overflow:visible"
       inkscape:isstock="true">
      <path
         inkscape:connector-curvature="0"
         id="path5779"
         style="fill:#3465a4;fill-opacity:1;fill-rule:evenodd;stroke:#3465a4;stroke-width:0.625;stroke-linejoin:round;stroke-opacity:1"
         d="M 8.7185878,4.0337352 -2.2072895,0.01601326 8.7185884,-4.0017078 c -1.7454984,2.3720609 -1.7354408,5.6174519 -6e-7,8.035443 z"
         transform="scale(-0.6)" />
    </marker>
    <marker
       inkscape:collect="always"
       inkscape:isstock="true"
       style="overflow:visible"
       id="marker5579"
       refX="0"
       refY="0"
       orient="auto"
       inkscape:stockid="Arrow2Mend">
      <path
         inkscape:connector-curvature="0"
         transform="scale(-0.6)"
         d="M 8.7185878,4.0337352 -2.2072895,0.01601326 8.7185884,-4.0017078 c -1.7454984,2.3720609 -1.7354408,5.6174519 -6e-7,8.035443 z"
         style="fill:#3465a4;fill-opacity:1;fill-rule:evenodd;stroke:#3465a4;stroke-width:0.625;stroke-linejoin:round;stroke-opacity:1"
         id="path5577" />
    </marker>
    <marker
       inkscape:collect="always"
       inkscape:stockid="Arrow2Mend"
       orient="auto"
       refY="0"
       refX="0"
       id="marker5385"
       style="overflow:visible"
       inkscape:isstock="true">
      <path
         inkscape:connector-curvature="0"
         id="path5383"
         style="fill:#3465a4;fill-opacity:1;fill-rule:evenodd;stroke:#3465a4;stroke-width:0.625;stroke-linejoin:round;stroke-opacity:1"
         d="M 8.7185878,4.0337352 -2.2072895,0.01601326 8.7185884,-4.0017078 c -1.7454984,2.3720609 -1.7354408,5.6174519 -6e-7,8.035443 z"
         transform="scale(-0.6)" />
    </marker>
    <marker
       inkscape:collect="always"
       inkscape:isstock="true"
       style="overflow:visible"
       id="marker5199"
       refX="0"
       refY="0"
       orient="auto"
       inkscape:stockid="Arrow2Mend">
      <path
         inkscape:connector-curvature="0"
         transform="scale(-0.6)"
         d="M 8.7185878,4.0337352 -2.2072895,0.01601326 8.7185884,-4.0017078 c -1.7454984,2.3720609 -1.7354408,5.6174519 -6e-7,8.035443 z"
         style="fill:#3465a4;fill-opacity:1;fill-rule:evenodd;stroke:#3465a4;stroke-width:0.625;stroke-linejoin:round;stroke-opacity:1"
         id="path5197" />
    </marker>
    <marker
       inkscape:collect="always"
       inkscape:stockid="Arrow2Mend"
       orient="auto"
       refY="0"
       refX="0"
       id="marker5021"
       style="overflow:visible"
       inkscape:isstock="true">
      <path
         inkscape:connector-curvature="0"
         id="path5019"
         style="fill:#3465a4;fill-opacity:1;fill-rule:evenodd;stroke:#3465a4;stroke-width:0.625;stroke-linejoin:round;stroke-opacity:1"
         d="M 8.7185878,4.0337352 -2.2072895,0.01601326 8.7185884,-4.0017078 c -1.7454984,2.3720609 -1.7354408,5.6174519 -6e-7,8.035443 z"
         transform="scale(-0.6)" />
    </marker>
    <marker
       inkscape:collect="always"
       inkscape:isstock="true"
       style="overflow:visible"
       id="marker4851"
       refX="0"
       refY="0"
       orient="auto"
       inkscape:stockid="Arrow2Mend">
      <path
         inkscape:connector-curvature="0"
         transform="scale(-0.6)"
         d="M 8.7185878,4.0337352 -2.2072895,0.01601326 8.7185884,-4.0017078 c -1.7454984,2.3720609 -1.7354408,5.6174519 -6e-7,8.035443 z"
         style="fill:#3465a4;fill-opacity:1;fill-rule:evenodd;stroke:#3465a4;stroke-width:0.625;stroke-linejoin:round;stroke-opacity:1"
         id="path4849" />
    </marker>
    <marker
       inkscape:collect="always"
       inkscape:stockid="Arrow2Mend"
       orient="auto"
       refY="0"
       refX="0"
       id="marker4689"
       style="overflow:visible"
       inkscape:isstock="true">
      <path
         inkscape:connector-curvature="0"
         id="path4687"
         style="fill:#3465a4;fill-opacity:1;fill-rule:evenodd;stroke:#3465a4;stroke-width:0.625;stroke-linejoin:round;stroke-opacity:1"
         d="M 8.7185878,4.0337352 -2.2072895,0.01601326 8.7185884,-4.0017078 c -1.7454984,2.3720609 -1.7354408,5.6174519 -6e-7,8.035443 z"
         transform="scale(-0.6)" />
    </marker>
    <marker
       inkscape:collect="always"
       inkscape:isstock="true"
       style="overflow:visible"
       id="marker4535"
       refX="0"
       refY="0"
       orient="auto"
       inkscape:stockid="Arrow2Mend">
      <path
         inkscape:connector-curvature="0"
         transform="scale(-0.6)"
         d="M 8.7185878,4.0337352 -2.2072895,0.01601326 8.7185884,-4.0017078 c -1.7454984,2.3720609 -1.7354408,5.6174519 -6e-7,8.035443 z"
         style="fill:#3465a4;fill-opacity:1;fill-rule:evenodd;stroke:#3465a4;stroke-width:0.625;stroke-linejoin:round;stroke-opacity:1"
         id="path4533" />
    </marker>
    <marker
       inkscape:collect="always"
       inkscape:stockid="Arrow2Mend"
       orient="auto"
       refY="0"
       refX="0"
       id="marker4389"
       style="overflow:visible"
       inkscape:isstock="true">
      <path
         inkscape:connector-curvature="0"
         id="path4387"
         style="fill:#3465a4;fill-opacity:1;fill-rule:evenodd;stroke:#3465a4;stroke-width:0.625;stroke-linejoin:round;stroke-opacity:1"
         d="M 8.7185878,4.0337352 -2.2072895,0.01601326 8.7185884,-4.0017078 c -1.7454984,2.3720609 -1.7354408,5.6174519 -6e-7,8.035443 z"
         transform="scale(-0.6)" />
    </marker>
    <marker
       inkscape:isstock="true"
       style="overflow:visible"
       id="marker4113"
       refX="0"
       refY="0"
       orient="auto"
       inkscape:stockid="Arrow2Mend">
      <path
         inkscape:connector-curvature="0"
         transform="scale(-0.6)"
         d="M 8.7185878,4.0337352 -2.2072895,0.01601326 8.7185884,-4.0017078 c -1.7454984,2.3720609 -1.7354408,5.6174519 -6e-7,8.035443 z"
         style="fill:#3465a4;fill-opacity:1;fill-rule:evenodd;stroke:#3465a4;stroke-width:0.625;stroke-linejoin:round;stroke-opacity:1"
         id="path4111" />
    </marker>
    <marker
       inkscape:collect="always"
       inkscape:isstock="true"
       style="overflow:visible"
       id="marker4103"
       refX="0"
       refY="0"
       orient="auto"
       inkscape:stockid="Arrow2Mend">
      <path
         inkscape:connector-curvature="0"
         transform="scale(-0.6)"
         d="M 8.7185878,4.0337352 -2.2072895,0.01601326 8.7185884,-4.0017078 c -1.7454984,2.3720609 -1.7354408,5.6174519 -6e-7,8.035443 z"
         style="fill:#3465a4;fill-opacity:1;fill-rule:evenodd;stroke:#3465a4;stroke-width:0.625;stroke-linejoin:round;stroke-opacity:1"
         id="path4101" />
    </marker>
    <marker
       inkscape:isstock="true"
       style="overflow:visible"
       id="marker2978"
       refX="0"
       refY="0"
       orient="auto"
       inkscape:stockid="Arrow2Mend">
      <path
         inkscape:connector-curvature="0"
         transform="scale(-0.6)"
         d="M 8.7185878,4.0337352 -2.2072895,0.01601326 8.7185884,-4.0017078 c -1.7454984,2.3720609 -1.7354408,5.6174519 -6e-7,8.035443 z"
         style="fill:#4e9a06;fill-opacity:1;fill-rule:evenodd;stroke:#4e9a06;stroke-width:0.625;stroke-linejoin:round;stroke-opacity:1"
         id="path2976" />
    </marker>
    <marker
       inkscape:collect="always"
       inkscape:stockid="Arrow2Mend"
       orient="auto"
       refY="0"
       refX="0"
       id="marker2692"
       style="overflow:visible"
       inkscape:isstock="true">
      <path
         inkscape:connector-curvature="0"
         id="path2690"
         style="fill:#4e9a06;fill-opacity:1;fill-rule:evenodd;stroke:#4e9a06;stroke-width:0.625;stroke-linejoin:round;stroke-opacity:1"
         d="M 8.7185878,4.0337352 -2.2072895,0.01601326 8.7185884,-4.0017078 c -1.7454984,2.3720609 -1.7354408,5.6174519 -6e-7,8.035443 z"
         transform="scale(-0.6)" />
    </marker>
    <marker
       inkscape:collect="always"
       inkscape:isstock="true"
       style="overflow:visible"
       id="marker2468"
       refX="0"
       refY="0"
       orient="auto"
       inkscape:stockid="Arrow2Mend">
      <path
         inkscape:connector-curvature="0"
         transform="scale(-0.6)"
         d="M 8.7185878,4.0337352 -2.2072895,0.01601326 8.7185884,-4.0017078 c -1.7454984,2.3720609 -1.7354408,5.6174519 -6e-7,8.035443 z"
         style="fill:#4e9a06;fill-opacity:1;fill-rule:evenodd;stroke:#4e9a06;stroke-width:0.625;stroke-linejoin:round;stroke-opacity:1"
         id="path2466" />
    </marker>
    <marker
       inkscape:collect="always"
       inkscape:stockid="Arrow2Mend"
       orient="auto"
       refY="0"
       refX="0"
       id="marker2222"
       style="overflow:visible"
       inkscape:isstock="true">
      <path
         inkscape:connector-curvature="0"
         id="path2220"
         style="fill:#4e9a06;fill-opacity:1;fill-rule:evenodd;stroke:#4e9a06;stroke-width:0.625;stroke-linejoin:round;stroke-opacity:1"
         d="M 8.7185878,4.0337352 -2.2072895,0.01601326 8.7185884,-4.0017078 c -1.7454984,2.3720609 -1.7354408,5.6174519 -6e-7,8.035443 z"
         transform="scale(-0.6)" />
    </marker>
    <marker
       inkscape:collect="always"
       inkscape:isstock="true"
       style="overflow:visible"
       id="marker1930"
       refX="0"
       refY="0"
       orient="auto"
       inkscape:stockid="Arrow2Mend">
      <path
         inkscape:connector-curvature="0"
         transform="scale(-0.6)"
         d="M 8.7185878,4.0337352 -2.2072895,0.01601326 8.7185884,-4.0017078 c -1.7454984,2.3720609 -1.7354408,5.6174519 -6e-7,8.035443 z"
         style="fill:#4e9a06;fill-opacity:1;fill-rule:evenodd;stroke:#4e9a06;stroke-width:0.625;stroke-linejoin:round;stroke-opacity:1"
         id="path1928" />
    </marker>
    <marker
       inkscape:collect="always"
       inkscape:stockid="Arrow2Mend"
       orient="auto"
       refY="0"
       refX="0"
       id="marker1688"
       style="overflow:visible"
       inkscape:isstock="true">
      <path
         inkscape:connector-curvature="0"
         id="path1686"
         style="fill:#4e9a06;fill-opacity:1;fill-rule:evenodd;stroke:#4e9a06;stroke-width:0.625;stroke-linejoin:round;stroke-opacity:1"
         d="M 8.7185878,4.0337352 -2.2072895,0.01601326 8.7185884,-4.0017078 c -1.7454984,2.3720609 -1.7354408,5.6174519 -6e-7,8.035443 z"
         transform="scale(-0.6)" />
    </marker>
    <marker
       inkscape:collect="always"
       inkscape:isstock="true"
       style="overflow:visible"
       id="Arrow2Mend"
       refX="0"
       refY="0"
       orient="auto"
       inkscape:stockid="Arrow2Mend">
      <path
         inkscape:connector-curvature="0"
         transform="scale(-0.6)"
         d="M 8.7185878,4.0337352 -2.2072895,0.01601326 8.7185884,-4.0017078 c -1.7454984,2.3720609 -1.7354408,5.6174519 -6e-7,8.035443 z"
         style="fill:#4e9a06;fill-opacity:1;fill-rule:evenodd;stroke:#4e9a06;stroke-width:0.625;stroke-linejoin:round;stroke-opacity:1"
         id="path1061" />
    </marker>
    <marker
       inkscape:isstock="true"
       style="overflow:visible"
       id="Arrow2Lend"
       refX="0"
       refY="0"
       orient="auto"
       inkscape:stockid="Arrow2Lend">
      <path
         inkscape:connector-curvature="0"
         transform="matrix(-1.1,0,0,-1.1,-1.1,0)"
         d="M 8.7185878,4.0337352 -2.2072895,0.01601326 8.7185884,-4.0017078 c -1.7454984,2.3720609 -1.7354408,5.6174519 -6e-7,8.035443 z"
         style="fill:#000000;fill-opacity:1;fill-rule:evenodd;stroke:#000000;stroke-width:0.625;stroke-linejoin:round;stroke-opacity:1"
         id="path1055" />
    </marker>
    <marker
       inkscape:isstock="true"
       style="overflow:visible"
       id="Arrow1Lend"
       refX="0"
       refY="0"
       orient="auto"
       inkscape:stockid="Arrow1Lend">
      <path
         inkscape:connector-curvature="0"
         transform="matrix(-0.8,0,0,-0.8,-10,0)"
         style="fill:#000000;fill-opacity:1;fill-rule:evenodd;stroke:#000000;stroke-width:1pt;stroke-opacity:1"
         d="M 0,0 5,-5 -12.5,0 5,5 Z"
         id="path1037" />
    </marker>
    <marker
       style="overflow:visible"
       id="Arrow1Mend"
       refX="0"
       refY="0"
       orient="auto"
       inkscape:stockid="Arrow1Mend">
      <path
         inkscape:connector-curvature="0"
         style="fill-rule:evenodd;stroke:#000000;stroke-width:0.426667pt;marker-start:none"
         d="M -4.2666667,0 -6.4,2.1333333 1.0666667,0 -6.4,-2.1333333 Z"
         id="path3772" />
    </marker>
    <inkscape:perspective
       id="perspective10"
       inkscape:persp3d-origin="396.85039 : -587.5297 : 1"
       inkscape:vp_z="793.70078 : -400.44308 : 1"
       inkscape:vp_y="0 : 1066.6667 : 0"
       inkscape:vp_x="0 : -400.44308 : 1"
       sodipodi:type="inkscape:persp3d" />
  </defs>
  <sodipodi:namedview
     inkscape:snap-bbox-edge-midpoints="true"
     inkscape:snap-bbox="true"
     inkscape:snap-text-baseline="false"
     units="mm"
     fit-margin-bottom="5"
     fit-margin-right="5"
     fit-margin-left="5"
     fit-margin-top="5"
     inkscape:document-rotation="0"
     inkscape:window-maximized="1"
     inkscape:window-y="27"
     inkscape:window-x="0"
     inkscape:window-height="986"
     inkscape:window-width="1680"
     gridtolerance="10000"
     showgrid="true"
     inkscape:current-layer="layer3"
     inkscape:document-units="mm"
     inkscape:cy="50.875138"
     inkscape:cx="860.83016"
     inkscape:zoom="1.3565998"
     inkscape:pageshadow="2"
     inkscape:pageopacity="0.0"
     borderopacity="1.0"
     bordercolor="#666666"
     pagecolor="#ffffff"
     id="base">
    <inkscape:grid
       originy="258.28448"
       originx="184.34731"
       spacingy="3.7795276"
       spacingx="3.7795276"
       units="cm"
       enabled="true"
       visible="true"
       id="grid2383"
       type="xygrid" />
  </sodipodi:namedview>
  <metadata
     id="metadata7">
    <rdf:RDF>
      <cc:Work
         rdf:about="">
        <dc:format>image/svg+xml</dc:format>
        <dc:type
           rdf:resource="http://purl.org/dc/dcmitype/StillImage" />
        <dc:title></dc:title>
      </cc:Work>
    </rdf:RDF>
  </metadata>
  <g
     transform="translate(184.34731,258.28448)"
     id="layer1"
     inkscape:groupmode="layer"
     inkscape:label="Axe">
    <text
       id="text27"
       y="-162.51968"
       x="6.3502227e-07"
       style="color:#000000;font-size:16px;line-height:26.6667px;font-family:'Komika Text';-inkscape-font-specification:'Komika Text';text-decoration:none;text-decoration-line:none;writing-mode:lr-tb;overflow:visible;fill:#000000;stroke-width:1.37953;stroke-linecap:round;stroke-linejoin:round;font-weight:normal;font-style:normal;font-stretch:normal;font-variant:normal;"
       xml:space="preserve"><tspan
         y="-162.51968"
         x="6.3502227e-07"
         id="tspan25"
         sodipodi:role="line" /><tspan
         id="tspan29"
         y="-135.85298"
         x="6.3502227e-07"
         sodipodi:role="line" /></text>
    <text
       id="text33"
       y="-181.41733"
       x="6.3502227e-07"
       style="color:#000000;font-style:normal;font-variant:normal;font-weight:normal;font-stretch:normal;font-size:16px;line-height:26.6667px;font-family:'Komika Text';-inkscape-font-specification:'Komika Text';text-decoration:none;text-decoration-line:none;writing-mode:lr-tb;overflow:visible;fill:#000000;stroke-width:1.37953;stroke-linecap:round;stroke-linejoin:round;"
       xml:space="preserve"><tspan
         y="-181.41733"
         x="6.3502227e-07"
         id="tspan31"
         sodipodi:role="line" /></text>
    <path
       inkscape:connector-curvature="0"
       id="path1032"
       d="M -98.267719,-170.07874 H 755.90552"
       style="fill:none;fill-rule:evenodd;stroke:#000000;stroke-width:1px;stroke-linecap:butt;stroke-linejoin:miter;stroke-opacity:1;marker-end:url(#Arrow1Mend);" />
  </g>
  <g
     inkscape:groupmode="layer"
     id="layer4"
     inkscape:label="Nom notes" />
  <g
     inkscape:groupmode="layer"
     id="layer2"
     inkscape:label="Quintes"
     style="display:inline">
    <text
       xml:space="preserve"
       style="color:#000000;font-style:normal;font-variant:normal;font-weight:normal;font-stretch:normal;font-size:22.8323px;line-height:23.5933px;font-family:'Komika Text';-inkscape-font-specification:'Komika Text';text-align:center;text-decoration:none;text-decoration-line:none;writing-mode:lr-tb;text-anchor:middle;overflow:visible;fill:#3465a4;stroke:none;stroke-width:1.42702;stroke-linecap:round;stroke-linejoin:round;stroke-miterlimit:4;stroke-dasharray:none"
       x="1094.4915"
       y="-131.69995"
       id="text8364"
       transform="matrix(0.70076147,0,0,1.4270191,184.34731,258.28448)"><tspan
         sodipodi:role="line"
         id="tspan8362"
         x="1094.4915"
         y="-131.69995"
         style="font-style:normal;font-variant:normal;font-weight:normal;font-stretch:normal;font-family:'Komika Text';-inkscape-font-specification:'Komika Text';stroke-width:1.42702">(   )</tspan></text>
    <text
       xml:space="preserve"
       style="color:#000000;font-style:normal;font-variant:normal;font-weight:normal;font-stretch:normal;font-size:16px;line-height:0;font-family:'Komika Text';-inkscape-font-specification:'Komika Text';text-align:center;text-decoration:none;text-decoration-line:none;writing-mode:lr-tb;text-anchor:middle;overflow:visible;fill:#3465a4;stroke:none;stroke-width:1;stroke-linecap:round;stroke-linejoin:round;stroke-miterlimit:4;stroke-dasharray:none"
       x="-57.681404"
       y="-228.18684"
       id="text3834"
       transform="translate(184.34731,258.28448)"><tspan
         sodipodi:role="line"
         id="tspan3832"
         x="-57.681404"
         y="-228.18684"
         style="font-style:normal;font-variant:normal;font-weight:normal;font-stretch:normal;line-height:16.5333px;font-family:'Komika Text';-inkscape-font-specification:'Komika Text'">3</tspan><tspan
         sodipodi:role="line"
         x="-57.681404"
         y="-211.65355"
         id="tspan3836"
         style="font-style:normal;font-variant:normal;font-weight:normal;font-stretch:normal;line-height:16.5333px;font-family:'Komika Text';-inkscape-font-specification:'Komika Text'">2</tspan></text>
    <text
       xml:space="preserve"
       style="color:#000000;font-style:normal;font-variant:normal;font-weight:normal;font-stretch:normal;font-size:16px;line-height:16.5333px;font-family:'Komika Text';-inkscape-font-specification:'Komika Text';text-align:center;text-decoration:none;text-decoration-line:none;writing-mode:lr-tb;text-anchor:middle;overflow:visible;fill:#3465a4;stroke:none;stroke-width:1;stroke-linecap:round;stroke-linejoin:round;stroke-miterlimit:4;stroke-dasharray:none"
       x="-61.240459"
       y="-221.29619"
       id="text3840"
       transform="translate(184.34731,258.28448)"><tspan
         sodipodi:role="line"
         id="tspan3838"
         x="-61.240459"
         y="-221.29619">×—</tspan></text>
    <text
       id="text4379"
       y="-228.18684"
       x="8.3771811"
       style="color:#000000;font-style:normal;font-variant:normal;font-weight:normal;font-stretch:normal;font-size:16px;line-height:0;font-family:'Komika Text';-inkscape-font-specification:'Komika Text';text-align:center;text-decoration:none;text-decoration-line:none;writing-mode:lr-tb;text-anchor:middle;overflow:visible;fill:#3465a4;stroke:none;stroke-width:1;stroke-linecap:round;stroke-linejoin:round;stroke-miterlimit:4;stroke-dasharray:none"
       xml:space="preserve"
       transform="translate(184.34731,258.28448)"><tspan
         style="font-style:normal;font-variant:normal;font-weight:normal;font-stretch:normal;line-height:16.5333px;font-family:'Komika Text';-inkscape-font-specification:'Komika Text'"
         y="-228.18684"
         x="8.3771811"
         id="tspan4375"
         sodipodi:role="line">3</tspan><tspan
         style="font-style:normal;font-variant:normal;font-weight:normal;font-stretch:normal;line-height:16.5333px;font-family:'Komika Text';-inkscape-font-specification:'Komika Text'"
         id="tspan4377"
         y="-211.65355"
         x="8.3771811"
         sodipodi:role="line">2</tspan></text>
    <text
       id="text4383"
       y="-221.29619"
       x="4.8181252"
       style="color:#000000;font-style:normal;font-variant:normal;font-weight:normal;font-stretch:normal;font-size:16px;line-height:16.5333px;font-family:'Komika Text';-inkscape-font-specification:'Komika Text';text-align:center;text-decoration:none;text-decoration-line:none;writing-mode:lr-tb;text-anchor:middle;overflow:visible;fill:#3465a4;stroke:none;stroke-width:1;stroke-linecap:round;stroke-linejoin:round;stroke-miterlimit:4;stroke-dasharray:none"
       xml:space="preserve"
       transform="translate(184.34731,258.28448)"><tspan
         y="-221.29619"
         x="4.8181252"
         id="tspan4381"
         sodipodi:role="line">×—</tspan></text>
    <text
       xml:space="preserve"
       style="color:#000000;font-style:normal;font-variant:normal;font-weight:normal;font-stretch:normal;font-size:16px;line-height:0;font-family:'Komika Text';-inkscape-font-specification:'Komika Text';text-align:center;text-decoration:none;text-decoration-line:none;writing-mode:lr-tb;text-anchor:middle;overflow:visible;fill:#3465a4;stroke:none;stroke-width:1;stroke-linecap:round;stroke-linejoin:round;stroke-miterlimit:4;stroke-dasharray:none"
       x="74.43576"
       y="-228.18684"
       id="text4525"
       transform="translate(184.34731,258.28448)"><tspan
         sodipodi:role="line"
         id="tspan4521"
         x="74.43576"
         y="-228.18684"
         style="font-style:normal;font-variant:normal;font-weight:normal;font-stretch:normal;line-height:16.5333px;font-family:'Komika Text';-inkscape-font-specification:'Komika Text'">3</tspan><tspan
         sodipodi:role="line"
         x="74.43576"
         y="-211.65355"
         id="tspan4523"
         style="font-style:normal;font-variant:normal;font-weight:normal;font-stretch:normal;line-height:16.5333px;font-family:'Komika Text';-inkscape-font-specification:'Komika Text'">2</tspan></text>
    <text
       xml:space="preserve"
       style="color:#000000;font-style:normal;font-variant:normal;font-weight:normal;font-stretch:normal;font-size:16px;line-height:16.5333px;font-family:'Komika Text';-inkscape-font-specification:'Komika Text';text-align:center;text-decoration:none;text-decoration-line:none;writing-mode:lr-tb;text-anchor:middle;overflow:visible;fill:#3465a4;stroke:none;stroke-width:1;stroke-linecap:round;stroke-linejoin:round;stroke-miterlimit:4;stroke-dasharray:none"
       x="70.876709"
       y="-221.29619"
       id="text4529"
       transform="translate(184.34731,258.28448)"><tspan
         sodipodi:role="line"
         id="tspan4527"
         x="70.876709"
         y="-221.29619">×—</tspan></text>
    <text
       id="text4679"
       y="-228.18684"
       x="140.49434"
       style="color:#000000;font-style:normal;font-variant:normal;font-weight:normal;font-stretch:normal;font-size:16px;line-height:0;font-family:'Komika Text';-inkscape-font-specification:'Komika Text';text-align:center;text-decoration:none;text-decoration-line:none;writing-mode:lr-tb;text-anchor:middle;overflow:visible;fill:#3465a4;stroke:none;stroke-width:1;stroke-linecap:round;stroke-linejoin:round;stroke-miterlimit:4;stroke-dasharray:none"
       xml:space="preserve"
       transform="translate(184.34731,258.28448)"><tspan
         style="font-style:normal;font-variant:normal;font-weight:normal;font-stretch:normal;line-height:16.5333px;font-family:'Komika Text';-inkscape-font-specification:'Komika Text'"
         y="-228.18684"
         x="140.49434"
         id="tspan4675"
         sodipodi:role="line">3</tspan><tspan
         style="font-style:normal;font-variant:normal;font-weight:normal;font-stretch:normal;line-height:16.5333px;font-family:'Komika Text';-inkscape-font-specification:'Komika Text'"
         id="tspan4677"
         y="-211.65355"
         x="140.49434"
         sodipodi:role="line">2</tspan></text>
    <text
       id="text4683"
       y="-221.29619"
       x="136.93529"
       style="color:#000000;font-style:normal;font-variant:normal;font-weight:normal;font-stretch:normal;font-size:16px;line-height:16.5333px;font-family:'Komika Text';-inkscape-font-specification:'Komika Text';text-align:center;text-decoration:none;text-decoration-line:none;writing-mode:lr-tb;text-anchor:middle;overflow:visible;fill:#3465a4;stroke:none;stroke-width:1;stroke-linecap:round;stroke-linejoin:round;stroke-miterlimit:4;stroke-dasharray:none"
       xml:space="preserve"
       transform="translate(184.34731,258.28448)"><tspan
         y="-221.29619"
         x="136.93529"
         id="tspan4681"
         sodipodi:role="line">×—</tspan></text>
    <text
       xml:space="preserve"
       style="color:#000000;font-style:normal;font-variant:normal;font-weight:normal;font-stretch:normal;font-size:16px;line-height:0;font-family:'Komika Text';-inkscape-font-specification:'Komika Text';text-align:center;text-decoration:none;text-decoration-line:none;writing-mode:lr-tb;text-anchor:middle;overflow:visible;fill:#3465a4;stroke:none;stroke-width:1;stroke-linecap:round;stroke-linejoin:round;stroke-miterlimit:4;stroke-dasharray:none"
       x="206.55292"
       y="-228.18684"
       id="text4841"
       transform="translate(184.34731,258.28448)"><tspan
         sodipodi:role="line"
         id="tspan4837"
         x="206.55292"
         y="-228.18684"
         style="font-style:normal;font-variant:normal;font-weight:normal;font-stretch:normal;line-height:16.5333px;font-family:'Komika Text';-inkscape-font-specification:'Komika Text'">3</tspan><tspan
         sodipodi:role="line"
         x="206.55292"
         y="-211.65355"
         id="tspan4839"
         style="font-style:normal;font-variant:normal;font-weight:normal;font-stretch:normal;line-height:16.5333px;font-family:'Komika Text';-inkscape-font-specification:'Komika Text'">2</tspan></text>
    <text
       xml:space="preserve"
       style="color:#000000;font-style:normal;font-variant:normal;font-weight:normal;font-stretch:normal;font-size:16px;line-height:16.5333px;font-family:'Komika Text';-inkscape-font-specification:'Komika Text';text-align:center;text-decoration:none;text-decoration-line:none;writing-mode:lr-tb;text-anchor:middle;overflow:visible;fill:#3465a4;stroke:none;stroke-width:1;stroke-linecap:round;stroke-linejoin:round;stroke-miterlimit:4;stroke-dasharray:none"
       x="202.99387"
       y="-221.29619"
       id="text4845"
       transform="translate(184.34731,258.28448)"><tspan
         sodipodi:role="line"
         id="tspan4843"
         x="202.99387"
         y="-221.29619">×—</tspan></text>
    <text
       id="text5011"
       y="-228.18684"
       x="272.61151"
       style="color:#000000;font-style:normal;font-variant:normal;font-weight:normal;font-stretch:normal;font-size:16px;line-height:0;font-family:'Komika Text';-inkscape-font-specification:'Komika Text';text-align:center;text-decoration:none;text-decoration-line:none;writing-mode:lr-tb;text-anchor:middle;overflow:visible;fill:#3465a4;stroke:none;stroke-width:1;stroke-linecap:round;stroke-linejoin:round;stroke-miterlimit:4;stroke-dasharray:none"
       xml:space="preserve"
       transform="translate(184.34731,258.28448)"><tspan
         style="font-style:normal;font-variant:normal;font-weight:normal;font-stretch:normal;line-height:16.5333px;font-family:'Komika Text';-inkscape-font-specification:'Komika Text'"
         y="-228.18684"
         x="272.61151"
         id="tspan5007"
         sodipodi:role="line">3</tspan><tspan
         style="font-style:normal;font-variant:normal;font-weight:normal;font-stretch:normal;line-height:16.5333px;font-family:'Komika Text';-inkscape-font-specification:'Komika Text'"
         id="tspan5009"
         y="-211.65355"
         x="272.61151"
         sodipodi:role="line">2</tspan></text>
    <text
       id="text5015"
       y="-221.29619"
       x="269.05246"
       style="color:#000000;font-style:normal;font-variant:normal;font-weight:normal;font-stretch:normal;font-size:16px;line-height:16.5333px;font-family:'Komika Text';-inkscape-font-specification:'Komika Text';text-align:center;text-decoration:none;text-decoration-line:none;writing-mode:lr-tb;text-anchor:middle;overflow:visible;fill:#3465a4;stroke:none;stroke-width:1;stroke-linecap:round;stroke-linejoin:round;stroke-miterlimit:4;stroke-dasharray:none"
       xml:space="preserve"
       transform="translate(184.34731,258.28448)"><tspan
         y="-221.29619"
         x="269.05246"
         id="tspan5013"
         sodipodi:role="line">×—</tspan></text>
    <text
       xml:space="preserve"
       style="color:#000000;font-style:normal;font-variant:normal;font-weight:normal;font-stretch:normal;font-size:16px;line-height:0;font-family:'Komika Text';-inkscape-font-specification:'Komika Text';text-align:center;text-decoration:none;text-decoration-line:none;writing-mode:lr-tb;text-anchor:middle;overflow:visible;fill:#3465a4;stroke:none;stroke-width:1;stroke-linecap:round;stroke-linejoin:round;stroke-miterlimit:4;stroke-dasharray:none"
       x="338.67007"
       y="-228.18684"
       id="text5189"
       transform="translate(184.34731,258.28448)"><tspan
         sodipodi:role="line"
         id="tspan5185"
         x="338.67007"
         y="-228.18684"
         style="font-style:normal;font-variant:normal;font-weight:normal;font-stretch:normal;line-height:16.5333px;font-family:'Komika Text';-inkscape-font-specification:'Komika Text'">3</tspan><tspan
         sodipodi:role="line"
         x="338.67007"
         y="-211.65355"
         id="tspan5187"
         style="font-style:normal;font-variant:normal;font-weight:normal;font-stretch:normal;line-height:16.5333px;font-family:'Komika Text';-inkscape-font-specification:'Komika Text'">2</tspan></text>
    <text
       xml:space="preserve"
       style="color:#000000;font-style:normal;font-variant:normal;font-weight:normal;font-stretch:normal;font-size:16px;line-height:16.5333px;font-family:'Komika Text';-inkscape-font-specification:'Komika Text';text-align:center;text-decoration:none;text-decoration-line:none;writing-mode:lr-tb;text-anchor:middle;overflow:visible;fill:#3465a4;stroke:none;stroke-width:1;stroke-linecap:round;stroke-linejoin:round;stroke-miterlimit:4;stroke-dasharray:none"
       x="335.11102"
       y="-221.29619"
       id="text5193"
       transform="translate(184.34731,258.28448)"><tspan
         sodipodi:role="line"
         id="tspan5191"
         x="335.11102"
         y="-221.29619">×—</tspan></text>
    <text
       id="text5375"
       y="-228.18684"
       x="404.72867"
       style="color:#000000;font-style:normal;font-variant:normal;font-weight:normal;font-stretch:normal;font-size:16px;line-height:0;font-family:'Komika Text';-inkscape-font-specification:'Komika Text';text-align:center;text-decoration:none;text-decoration-line:none;writing-mode:lr-tb;text-anchor:middle;overflow:visible;fill:#3465a4;stroke:none;stroke-width:1;stroke-linecap:round;stroke-linejoin:round;stroke-miterlimit:4;stroke-dasharray:none"
       xml:space="preserve"
       transform="translate(184.34731,258.28448)"><tspan
         style="font-style:normal;font-variant:normal;font-weight:normal;font-stretch:normal;line-height:16.5333px;font-family:'Komika Text';-inkscape-font-specification:'Komika Text'"
         y="-228.18684"
         x="404.72867"
         id="tspan5371"
         sodipodi:role="line">3</tspan><tspan
         style="font-style:normal;font-variant:normal;font-weight:normal;font-stretch:normal;line-height:16.5333px;font-family:'Komika Text';-inkscape-font-specification:'Komika Text'"
         id="tspan5373"
         y="-211.65355"
         x="404.72867"
         sodipodi:role="line">2</tspan></text>
    <text
       id="text5379"
       y="-221.29619"
       x="401.16962"
       style="color:#000000;font-style:normal;font-variant:normal;font-weight:normal;font-stretch:normal;font-size:16px;line-height:16.5333px;font-family:'Komika Text';-inkscape-font-specification:'Komika Text';text-align:center;text-decoration:none;text-decoration-line:none;writing-mode:lr-tb;text-anchor:middle;overflow:visible;fill:#3465a4;stroke:none;stroke-width:1;stroke-linecap:round;stroke-linejoin:round;stroke-miterlimit:4;stroke-dasharray:none"
       xml:space="preserve"
       transform="translate(184.34731,258.28448)"><tspan
         y="-221.29619"
         x="401.16962"
         id="tspan5377"
         sodipodi:role="line">×—</tspan></text>
    <text
       xml:space="preserve"
       style="color:#000000;font-style:normal;font-variant:normal;font-weight:normal;font-stretch:normal;font-size:16px;line-height:0;font-family:'Komika Text';-inkscape-font-specification:'Komika Text';text-align:center;text-decoration:none;text-decoration-line:none;writing-mode:lr-tb;text-anchor:middle;overflow:visible;fill:#3465a4;stroke:none;stroke-width:1;stroke-linecap:round;stroke-linejoin:round;stroke-miterlimit:4;stroke-dasharray:none"
       x="470.78723"
       y="-228.18684"
       id="text5569"
       transform="translate(184.34731,258.28448)"><tspan
         sodipodi:role="line"
         id="tspan5565"
         x="470.78723"
         y="-228.18684"
         style="font-style:normal;font-variant:normal;font-weight:normal;font-stretch:normal;line-height:16.5333px;font-family:'Komika Text';-inkscape-font-specification:'Komika Text'">3</tspan><tspan
         sodipodi:role="line"
         x="470.78723"
         y="-211.65355"
         id="tspan5567"
         style="font-style:normal;font-variant:normal;font-weight:normal;font-stretch:normal;line-height:16.5333px;font-family:'Komika Text';-inkscape-font-specification:'Komika Text'">2</tspan></text>
    <text
       xml:space="preserve"
       style="color:#000000;font-style:normal;font-variant:normal;font-weight:normal;font-stretch:normal;font-size:16px;line-height:16.5333px;font-family:'Komika Text';-inkscape-font-specification:'Komika Text';text-align:center;text-decoration:none;text-decoration-line:none;writing-mode:lr-tb;text-anchor:middle;overflow:visible;fill:#3465a4;stroke:none;stroke-width:1;stroke-linecap:round;stroke-linejoin:round;stroke-miterlimit:4;stroke-dasharray:none"
       x="467.22818"
       y="-221.29619"
       id="text5573"
       transform="translate(184.34731,258.28448)"><tspan
         sodipodi:role="line"
         id="tspan5571"
         x="467.22818"
         y="-221.29619">×—</tspan></text>
    <text
       id="text5771"
       y="-228.18684"
       x="536.84583"
       style="color:#000000;font-style:normal;font-variant:normal;font-weight:normal;font-stretch:normal;font-size:16px;line-height:0;font-family:'Komika Text';-inkscape-font-specification:'Komika Text';text-align:center;text-decoration:none;text-decoration-line:none;writing-mode:lr-tb;text-anchor:middle;overflow:visible;fill:#3465a4;stroke:none;stroke-width:1;stroke-linecap:round;stroke-linejoin:round;stroke-miterlimit:4;stroke-dasharray:none"
       xml:space="preserve"
       transform="translate(184.34731,258.28448)"><tspan
         style="font-style:normal;font-variant:normal;font-weight:normal;font-stretch:normal;line-height:16.5333px;font-family:'Komika Text';-inkscape-font-specification:'Komika Text'"
         y="-228.18684"
         x="536.84583"
         id="tspan5767"
         sodipodi:role="line">3</tspan><tspan
         style="font-style:normal;font-variant:normal;font-weight:normal;font-stretch:normal;line-height:16.5333px;font-family:'Komika Text';-inkscape-font-specification:'Komika Text'"
         id="tspan5769"
         y="-211.65355"
         x="536.84583"
         sodipodi:role="line">2</tspan></text>
    <text
       id="text5775"
       y="-221.29619"
       x="533.28674"
       style="color:#000000;font-style:normal;font-variant:normal;font-weight:normal;font-stretch:normal;font-size:16px;line-height:16.5333px;font-family:'Komika Text';-inkscape-font-specification:'Komika Text';text-align:center;text-decoration:none;text-decoration-line:none;writing-mode:lr-tb;text-anchor:middle;overflow:visible;fill:#3465a4;stroke:none;stroke-width:1;stroke-linecap:round;stroke-linejoin:round;stroke-miterlimit:4;stroke-dasharray:none"
       xml:space="preserve"
       transform="translate(184.34731,258.28448)"><tspan
         y="-221.29619"
         x="533.28674"
         id="tspan5773"
         sodipodi:role="line">×—</tspan></text>
    <text
       xml:space="preserve"
       style="color:#000000;font-style:normal;font-variant:normal;font-weight:normal;font-stretch:normal;font-size:16px;line-height:0;font-family:'Komika Text';-inkscape-font-specification:'Komika Text';text-align:center;text-decoration:none;text-decoration-line:none;writing-mode:lr-tb;text-anchor:middle;overflow:visible;fill:#3465a4;stroke:none;stroke-width:1;stroke-linecap:round;stroke-linejoin:round;stroke-miterlimit:4;stroke-dasharray:none"
       x="602.90442"
       y="-228.18684"
       id="text5981"
       transform="translate(184.34731,258.28448)"><tspan
         sodipodi:role="line"
         id="tspan5977"
         x="602.90442"
         y="-228.18684"
         style="font-style:normal;font-variant:normal;font-weight:normal;font-stretch:normal;line-height:16.5333px;font-family:'Komika Text';-inkscape-font-specification:'Komika Text'">3</tspan><tspan
         sodipodi:role="line"
         x="602.90442"
         y="-211.65355"
         id="tspan5979"
         style="font-style:normal;font-variant:normal;font-weight:normal;font-stretch:normal;line-height:16.5333px;font-family:'Komika Text';-inkscape-font-specification:'Komika Text'">2</tspan></text>
    <text
       xml:space="preserve"
       style="color:#000000;font-style:normal;font-variant:normal;font-weight:normal;font-stretch:normal;font-size:16px;line-height:16.5333px;font-family:'Komika Text';-inkscape-font-specification:'Komika Text';text-align:center;text-decoration:none;text-decoration-line:none;writing-mode:lr-tb;text-anchor:middle;overflow:visible;fill:#3465a4;stroke:none;stroke-width:1;stroke-linecap:round;stroke-linejoin:round;stroke-miterlimit:4;stroke-dasharray:none"
       x="599.34534"
       y="-221.29619"
       id="text5985"
       transform="translate(184.34731,258.28448)"><tspan
         sodipodi:role="line"
         id="tspan5983"
         x="599.34534"
         y="-221.29619">×—</tspan></text>
    <text
       id="text6199"
       y="-228.18684"
       x="668.96295"
       style="color:#000000;font-style:normal;font-variant:normal;font-weight:normal;font-stretch:normal;font-size:16px;line-height:0;font-family:'Komika Text';-inkscape-font-specification:'Komika Text';text-align:center;text-decoration:none;text-decoration-line:none;writing-mode:lr-tb;text-anchor:middle;overflow:visible;fill:#3465a4;stroke:none;stroke-width:1;stroke-linecap:round;stroke-linejoin:round;stroke-miterlimit:4;stroke-dasharray:none"
       xml:space="preserve"
       transform="translate(184.34731,258.28448)"><tspan
         style="font-style:normal;font-variant:normal;font-weight:normal;font-stretch:normal;line-height:16.5333px;font-family:'Komika Text';-inkscape-font-specification:'Komika Text'"
         y="-228.18684"
         x="668.96295"
         id="tspan6195"
         sodipodi:role="line">3</tspan><tspan
         style="font-style:normal;font-variant:normal;font-weight:normal;font-stretch:normal;line-height:16.5333px;font-family:'Komika Text';-inkscape-font-specification:'Komika Text'"
         id="tspan6197"
         y="-211.65355"
         x="668.96295"
         sodipodi:role="line">2</tspan></text>
    <text
       id="text6203"
       y="-221.29619"
       x="665.40393"
       style="color:#000000;font-style:normal;font-variant:normal;font-weight:normal;font-stretch:normal;font-size:16px;line-height:16.5333px;font-family:'Komika Text';-inkscape-font-specification:'Komika Text';text-align:center;text-decoration:none;text-decoration-line:none;writing-mode:lr-tb;text-anchor:middle;overflow:visible;fill:#3465a4;stroke:none;stroke-width:1;stroke-linecap:round;stroke-linejoin:round;stroke-miterlimit:4;stroke-dasharray:none"
       xml:space="preserve"
       transform="translate(184.34731,258.28448)"><tspan
         y="-221.29619"
         x="665.40393"
         id="tspan6201"
         sodipodi:role="line">×—</tspan></text>
    <text
       id="text8335"
       y="-181.41733"
       x="-113.38583"
       style="color:#000000;font-style:normal;font-variant:normal;font-weight:normal;font-stretch:normal;font-size:16px;line-height:16.5333px;font-family:'Komika Text';-inkscape-font-specification:'Komika Text';text-align:end;text-decoration:none;text-decoration-line:none;writing-mode:lr-tb;text-anchor:end;overflow:visible;fill:#3465a4;stroke:none;stroke-width:1;stroke-linecap:round;stroke-linejoin:round;stroke-miterlimit:4;stroke-dasharray:none"
       xml:space="preserve"
       transform="translate(184.34731,258.28448)"><tspan
         y="-181.41733"
         x="-113.38583"
         id="tspan8333"
         sodipodi:role="line">Quintes</tspan></text>
    <text
       xml:space="preserve"
       style="color:#000000;font-style:normal;font-variant:normal;font-weight:normal;font-stretch:normal;font-size:16px;line-height:0;font-family:'Komika Text';-inkscape-font-specification:'Komika Text';text-align:center;text-decoration:none;text-decoration-line:none;writing-mode:lr-tb;text-anchor:middle;overflow:visible;fill:#3465a4;stroke:none;stroke-width:1;stroke-linecap:round;stroke-linejoin:round;stroke-miterlimit:4;stroke-dasharray:none"
       x="767.30096"
       y="-199.27185"
       id="text8345"
       transform="translate(184.34731,258.28448)"><tspan
         sodipodi:role="line"
         id="tspan8341"
         x="767.30096"
         y="-199.27185"
         style="font-style:normal;font-variant:normal;font-weight:normal;font-stretch:normal;line-height:16.5333px;font-family:'Komika Text';-inkscape-font-specification:'Komika Text'">3</tspan><tspan
         sodipodi:role="line"
         x="767.30096"
         y="-182.73856"
         id="tspan8343"
         style="font-style:normal;font-variant:normal;font-weight:normal;font-stretch:normal;line-height:16.5333px;font-family:'Komika Text';-inkscape-font-specification:'Komika Text'">2</tspan></text>
    <text
       xml:space="preserve"
       style="color:#000000;font-style:normal;font-variant:normal;font-weight:normal;font-stretch:normal;font-size:16px;line-height:16.5333px;font-family:'Komika Text';-inkscape-font-specification:'Komika Text';text-align:end;text-decoration:none;text-decoration-line:none;writing-mode:lr-tb;text-anchor:end;overflow:visible;fill:#3465a4;stroke:none;stroke-width:1;stroke-linecap:round;stroke-linejoin:round;stroke-miterlimit:4;stroke-dasharray:none"
       x="773.23694"
       y="-192.3812"
       id="text8349"
       transform="translate(184.34731,258.28448)"><tspan
         sodipodi:role="line"
         id="tspan8347"
         x="773.23694"
         y="-192.3812">—</tspan></text>
    <text
       xml:space="preserve"
       style="color:#000000;font-style:normal;font-variant:normal;font-weight:normal;font-stretch:normal;font-size:16px;line-height:16.5333px;font-family:'Komika Text';-inkscape-font-specification:'Komika Text';text-align:center;text-decoration:none;text-decoration-line:none;writing-mode:lr-tb;text-anchor:middle;overflow:visible;fill:#3465a4;stroke:none;stroke-width:1;stroke-linecap:round;stroke-linejoin:round;stroke-miterlimit:4;stroke-dasharray:none"
       x="782.86548"
       y="-201.6833"
       id="text8374"
       transform="translate(184.34731,258.28448)"><tspan
         sodipodi:role="line"
         id="tspan8372"
         x="782.86548"
         y="-201.6833"><tspan
           style="font-style:normal;font-variant:normal;font-weight:normal;font-stretch:normal;font-size:65%;font-family:'Komika Text';-inkscape-font-specification:'Komika Text';baseline-shift:super"
           id="tspan8376">12</tspan></tspan></text>
    <text
       id="text8382"
       y="-192.3492"
       x="819.72046"
       style="color:#000000;font-style:normal;font-variant:normal;font-weight:normal;font-stretch:normal;font-size:16px;line-height:16.5333px;font-family:'Komika Text';-inkscape-font-specification:'Komika Text';text-align:center;text-decoration:none;text-decoration-line:none;writing-mode:lr-tb;text-anchor:middle;overflow:visible;fill:#3465a4;stroke:none;stroke-width:1;stroke-linecap:round;stroke-linejoin:round;stroke-miterlimit:4;stroke-dasharray:none"
       xml:space="preserve"
       transform="translate(184.34731,258.28448)"><tspan
         y="-192.3492"
         x="819.72046"
         id="tspan8380"
         sodipodi:role="line"> = 129,146</tspan></text>
    <path
       style="fill:none;fill-rule:evenodd;stroke:#3465a4;stroke-width:1;stroke-linecap:butt;stroke-linejoin:miter;stroke-miterlimit:4;stroke-dasharray:none;stroke-opacity:1;marker-end:url(#marker4103)"
       d="m -90.708663,-196.53543 c 10.572754,-15.65601 48.634667,-15.65601 59.207421,0"
       id="path3264"
       inkscape:connector-curvature="0"
       sodipodi:nodetypes="cc"
       transform="translate(184.34731,258.28448)" />
    <path
       sodipodi:nodetypes="cc"
       inkscape:connector-curvature="0"
       id="path4373"
       d="m -24.650081,-196.53543 c 10.572755,-15.65601 48.634671,-15.65601 59.207421,0"
       style="fill:none;fill-rule:evenodd;stroke:#3465a4;stroke-width:1;stroke-linecap:butt;stroke-linejoin:miter;stroke-miterlimit:4;stroke-dasharray:none;stroke-opacity:1;marker-end:url(#marker4389)"
       transform="translate(184.34731,258.28448)" />
    <path
       style="fill:none;fill-rule:evenodd;stroke:#3465a4;stroke-width:1;stroke-linecap:butt;stroke-linejoin:miter;stroke-miterlimit:4;stroke-dasharray:none;stroke-opacity:1;marker-end:url(#marker4535)"
       d="m 41.4085,-196.53543 c 10.57276,-15.65601 48.634674,-15.65601 59.20742,0"
       id="path4519"
       inkscape:connector-curvature="0"
       sodipodi:nodetypes="cc"
       transform="translate(184.34731,258.28448)" />
    <path
       sodipodi:nodetypes="cc"
       inkscape:connector-curvature="0"
       id="path4673"
       d="m 107.46708,-196.53543 c 10.57276,-15.65601 48.63467,-15.65601 59.20742,0"
       style="fill:none;fill-rule:evenodd;stroke:#3465a4;stroke-width:1;stroke-linecap:butt;stroke-linejoin:miter;stroke-miterlimit:4;stroke-dasharray:none;stroke-opacity:1;marker-end:url(#marker4689)"
       transform="translate(184.34731,258.28448)" />
    <path
       style="fill:none;fill-rule:evenodd;stroke:#3465a4;stroke-width:1;stroke-linecap:butt;stroke-linejoin:miter;stroke-miterlimit:4;stroke-dasharray:none;stroke-opacity:1;marker-end:url(#marker4851)"
       d="m 173.52566,-196.53543 c 10.57276,-15.65601 48.63467,-15.65601 59.20742,0"
       id="path4835"
       inkscape:connector-curvature="0"
       sodipodi:nodetypes="cc"
       transform="translate(184.34731,258.28448)" />
    <path
       sodipodi:nodetypes="cc"
       inkscape:connector-curvature="0"
       id="path5005"
       d="m 239.58424,-196.53543 c 10.57276,-15.65601 48.63467,-15.65601 59.20742,0"
       style="fill:none;fill-rule:evenodd;stroke:#3465a4;stroke-width:1;stroke-linecap:butt;stroke-linejoin:miter;stroke-miterlimit:4;stroke-dasharray:none;stroke-opacity:1;marker-end:url(#marker5021)"
       transform="translate(184.34731,258.28448)" />
    <path
       style="fill:none;fill-rule:evenodd;stroke:#3465a4;stroke-width:1;stroke-linecap:butt;stroke-linejoin:miter;stroke-miterlimit:4;stroke-dasharray:none;stroke-opacity:1;marker-end:url(#marker5199)"
       d="m 305.64282,-196.53543 c 10.57276,-15.65601 48.63467,-15.65601 59.20742,0"
       id="path5183"
       inkscape:connector-curvature="0"
       sodipodi:nodetypes="cc"
       transform="translate(184.34731,258.28448)" />
    <path
       sodipodi:nodetypes="cc"
       inkscape:connector-curvature="0"
       id="path5369"
       d="m 371.7014,-196.53543 c 10.57276,-15.65601 48.63467,-15.65601 59.20742,0"
       style="fill:none;fill-rule:evenodd;stroke:#3465a4;stroke-width:1;stroke-linecap:butt;stroke-linejoin:miter;stroke-miterlimit:4;stroke-dasharray:none;stroke-opacity:1;marker-end:url(#marker5385)"
       transform="translate(184.34731,258.28448)" />
    <path
       style="fill:none;fill-rule:evenodd;stroke:#3465a4;stroke-width:1;stroke-linecap:butt;stroke-linejoin:miter;stroke-miterlimit:4;stroke-dasharray:none;stroke-opacity:1;marker-end:url(#marker5579)"
       d="m 437.75998,-196.53543 c 10.57276,-15.65601 48.63467,-15.65601 59.20742,0"
       id="path5563"
       inkscape:connector-curvature="0"
       sodipodi:nodetypes="cc"
       transform="translate(184.34731,258.28448)" />
    <path
       sodipodi:nodetypes="cc"
       inkscape:connector-curvature="0"
       id="path5765"
       d="m 503.81856,-196.53543 c 10.57276,-15.65601 48.63467,-15.65601 59.20742,0"
       style="fill:none;fill-rule:evenodd;stroke:#3465a4;stroke-width:1;stroke-linecap:butt;stroke-linejoin:miter;stroke-miterlimit:4;stroke-dasharray:none;stroke-opacity:1;marker-end:url(#marker5781)"
       transform="translate(184.34731,258.28448)" />
    <path
       style="fill:none;fill-rule:evenodd;stroke:#3465a4;stroke-width:1;stroke-linecap:butt;stroke-linejoin:miter;stroke-miterlimit:4;stroke-dasharray:none;stroke-opacity:1;marker-end:url(#marker5991)"
       d="m 569.87714,-196.53543 c 10.57276,-15.65601 48.63467,-15.65601 59.20742,0"
       id="path5975"
       inkscape:connector-curvature="0"
       sodipodi:nodetypes="cc"
       transform="translate(184.34731,258.28448)" />
    <path
       sodipodi:nodetypes="cc"
       inkscape:connector-curvature="0"
       id="path6193"
       d="m 635.93572,-196.53543 c 10.57276,-15.65601 48.63467,-15.65601 59.20742,0"
       style="fill:none;fill-rule:evenodd;stroke:#3465a4;stroke-width:1;stroke-linecap:butt;stroke-linejoin:miter;stroke-miterlimit:4;stroke-dasharray:none;stroke-opacity:1;marker-end:url(#marker6209)"
       transform="translate(184.34731,258.28448)" />
  </g>
  <g
     inkscape:groupmode="layer"
     id="layer3"
     inkscape:label="Octaves"
     style="display:inline">
    <text
       xml:space="preserve"
       style="color:#000000;font-style:normal;font-variant:normal;font-weight:normal;font-stretch:normal;font-size:16px;line-height:26.6667px;font-family:'Komika Text';-inkscape-font-specification:'Komika Text';text-align:center;text-decoration:none;text-decoration-line:none;writing-mode:lr-tb;text-anchor:middle;overflow:visible;fill:#4e9a06;stroke:none;stroke-width:1.37953;stroke-linecap:round;stroke-linejoin:round"
       x="700.39557"
       y="-147.40158"
       id="text171"
       transform="translate(184.34731,258.28448)"><tspan
         sodipodi:role="line"
         id="tspan169"
         x="700.39557"
         y="-147.40158">fa</tspan></text>
    <text
       id="text175"
       y="-147.40158"
       x="586.82935"
       style="color:#000000;font-style:normal;font-variant:normal;font-weight:normal;font-stretch:normal;font-size:16px;line-height:26.6667px;font-family:'Komika Text';-inkscape-font-specification:'Komika Text';text-align:center;text-decoration:none;text-decoration-line:none;writing-mode:lr-tb;text-anchor:middle;overflow:visible;fill:#4e9a06;stroke:none;stroke-width:1.37953;stroke-linecap:round;stroke-linejoin:round"
       xml:space="preserve"
       transform="translate(184.34731,258.28448)"><tspan
         y="-147.40158"
         x="586.82935"
         id="tspan173"
         sodipodi:role="line">fa</tspan></text>
    <text
       xml:space="preserve"
       style="color:#000000;font-style:normal;font-variant:normal;font-weight:normal;font-stretch:normal;font-size:16px;line-height:26.6667px;font-family:'Komika Text';-inkscape-font-specification:'Komika Text';text-align:center;text-decoration:none;text-decoration-line:none;writing-mode:lr-tb;text-anchor:middle;overflow:visible;fill:#4e9a06;stroke:none;stroke-width:1.37953;stroke-linecap:round;stroke-linejoin:round"
       x="473.26309"
       y="-147.40158"
       id="text179"
       transform="translate(184.34731,258.28448)"><tspan
         sodipodi:role="line"
         id="tspan177"
         x="473.26309"
         y="-147.40158">fa</tspan></text>
    <text
       id="text183"
       y="-147.40158"
       x="359.69684"
       style="color:#000000;font-style:normal;font-variant:normal;font-weight:normal;font-stretch:normal;font-size:16px;line-height:26.6667px;font-family:'Komika Text';-inkscape-font-specification:'Komika Text';text-align:center;text-decoration:none;text-decoration-line:none;writing-mode:lr-tb;text-anchor:middle;overflow:visible;fill:#4e9a06;stroke:none;stroke-width:1.37953;stroke-linecap:round;stroke-linejoin:round"
       xml:space="preserve"
       transform="translate(184.34731,258.28448)"><tspan
         y="-147.40158"
         x="359.69684"
         id="tspan181"
         sodipodi:role="line">fa</tspan></text>
    <text
       xml:space="preserve"
       style="color:#000000;font-style:normal;font-variant:normal;font-weight:normal;font-stretch:normal;font-size:16px;line-height:26.6667px;font-family:'Komika Text';-inkscape-font-specification:'Komika Text';text-align:center;text-decoration:none;text-decoration-line:none;writing-mode:lr-tb;text-anchor:middle;overflow:visible;fill:#4e9a06;stroke:none;stroke-width:1.37953;stroke-linecap:round;stroke-linejoin:round"
       x="246.13057"
       y="-147.40158"
       id="text187"
       transform="translate(184.34731,258.28448)"><tspan
         sodipodi:role="line"
         id="tspan185"
         x="246.13057"
         y="-147.40158">fa</tspan></text>
    <text
       id="text191"
       y="-147.40158"
       x="132.5643"
       style="color:#000000;font-style:normal;font-variant:normal;font-weight:normal;font-stretch:normal;font-size:16px;line-height:26.6667px;font-family:'Komika Text';-inkscape-font-specification:'Komika Text';text-align:center;text-decoration:none;text-decoration-line:none;writing-mode:lr-tb;text-anchor:middle;overflow:visible;fill:#4e9a06;stroke:none;stroke-width:1.37953;stroke-linecap:round;stroke-linejoin:round"
       xml:space="preserve"
       transform="translate(184.34731,258.28448)"><tspan
         y="-147.40158"
         x="132.5643"
         id="tspan189"
         sodipodi:role="line">fa</tspan></text>
    <text
       xml:space="preserve"
       style="color:#000000;font-style:normal;font-variant:normal;font-weight:normal;font-stretch:normal;font-size:16px;line-height:26.6667px;font-family:'Komika Text';-inkscape-font-specification:'Komika Text';text-align:center;text-decoration:none;text-decoration-line:none;writing-mode:lr-tb;text-anchor:middle;overflow:visible;fill:#4e9a06;stroke:none;stroke-width:1.37953;stroke-linecap:round;stroke-linejoin:round"
       x="-94.568192"
       y="-147.40158"
       id="text195"
       transform="translate(184.34731,258.28448)"><tspan
         sodipodi:role="line"
         id="tspan193"
         x="-94.568192"
         y="-147.40158">fa</tspan></text>
    <text
       id="text199"
       y="-147.40158"
       x="18.998047"
       style="color:#000000;font-style:normal;font-variant:normal;font-weight:normal;font-stretch:normal;font-size:16px;line-height:26.6667px;font-family:'Komika Text';-inkscape-font-specification:'Komika Text';text-align:center;text-decoration:none;text-decoration-line:none;writing-mode:lr-tb;text-anchor:middle;overflow:visible;fill:#4e9a06;stroke:none;stroke-width:1.37953;stroke-linecap:round;stroke-linejoin:round"
       xml:space="preserve"
       transform="translate(184.34731,258.28448)"><tspan
         y="-147.40158"
         x="18.998047"
         id="tspan197"
         sodipodi:role="line">fa</tspan></text>
    <text
       id="text1660"
       y="-117.16535"
       x="-37.795277"
       style="color:#000000;font-style:normal;font-variant:normal;font-weight:normal;font-stretch:normal;font-size:16px;line-height:26.6667px;font-family:'Komika Text';-inkscape-font-specification:'Komika Text';text-align:center;text-decoration:none;text-decoration-line:none;writing-mode:lr-tb;text-anchor:middle;overflow:visible;fill:#4e9a06;stroke:none;stroke-width:1;stroke-linecap:round;stroke-linejoin:round;stroke-miterlimit:4;stroke-dasharray:none"
       xml:space="preserve"
       transform="translate(184.34731,258.28448)"><tspan
         y="-117.16535"
         x="-37.795277"
         id="tspan1658"
         sodipodi:role="line">×2</tspan></text>
    <text
       xml:space="preserve"
       style="color:#000000;font-style:normal;font-variant:normal;font-weight:normal;font-stretch:normal;font-size:16px;line-height:26.6667px;font-family:'Komika Text';-inkscape-font-specification:'Komika Text';text-align:center;text-decoration:none;text-decoration-line:none;writing-mode:lr-tb;text-anchor:middle;overflow:visible;fill:#4e9a06;stroke:none;stroke-width:1;stroke-linecap:round;stroke-linejoin:round;stroke-miterlimit:4;stroke-dasharray:none"
       x="75.590546"
       y="-117.16535"
       id="text1684"
       transform="translate(184.34731,258.28448)"><tspan
         sodipodi:role="line"
         id="tspan1682"
         x="75.590546"
         y="-117.16535">×2</tspan></text>
    <text
       id="text1926"
       y="-117.16535"
       x="188.97638"
       style="color:#000000;font-style:normal;font-variant:normal;font-weight:normal;font-stretch:normal;font-size:16px;line-height:26.6667px;font-family:'Komika Text';-inkscape-font-specification:'Komika Text';text-align:center;text-decoration:none;text-decoration-line:none;writing-mode:lr-tb;text-anchor:middle;overflow:visible;fill:#4e9a06;stroke:none;stroke-width:1;stroke-linecap:round;stroke-linejoin:round;stroke-miterlimit:4;stroke-dasharray:none"
       xml:space="preserve"
       transform="translate(184.34731,258.28448)"><tspan
         y="-117.16535"
         x="188.97638"
         id="tspan1924"
         sodipodi:role="line">×2</tspan></text>
    <text
       xml:space="preserve"
       style="color:#000000;font-style:normal;font-variant:normal;font-weight:normal;font-stretch:normal;font-size:16px;line-height:26.6667px;font-family:'Komika Text';-inkscape-font-specification:'Komika Text';text-align:center;text-decoration:none;text-decoration-line:none;writing-mode:lr-tb;text-anchor:middle;overflow:visible;fill:#4e9a06;stroke:none;stroke-width:1;stroke-linecap:round;stroke-linejoin:round;stroke-miterlimit:4;stroke-dasharray:none"
       x="302.36221"
       y="-117.16535"
       id="text2218"
       transform="translate(184.34731,258.28448)"><tspan
         sodipodi:role="line"
         id="tspan2216"
         x="302.36221"
         y="-117.16535">×2</tspan></text>
    <text
       id="text2464"
       y="-117.16535"
       x="415.74805"
       style="color:#000000;font-style:normal;font-variant:normal;font-weight:normal;font-stretch:normal;font-size:16px;line-height:26.6667px;font-family:'Komika Text';-inkscape-font-specification:'Komika Text';text-align:center;text-decoration:none;text-decoration-line:none;writing-mode:lr-tb;text-anchor:middle;overflow:visible;fill:#4e9a06;stroke:none;stroke-width:1;stroke-linecap:round;stroke-linejoin:round;stroke-miterlimit:4;stroke-dasharray:none"
       xml:space="preserve"
       transform="translate(184.34731,258.28448)"><tspan
         y="-117.16535"
         x="415.74805"
         id="tspan2462"
         sodipodi:role="line">×2</tspan></text>
    <text
       xml:space="preserve"
       style="color:#000000;font-style:normal;font-variant:normal;font-weight:normal;font-stretch:normal;font-size:16px;line-height:26.6667px;font-family:'Komika Text';-inkscape-font-specification:'Komika Text';text-align:center;text-decoration:none;text-decoration-line:none;writing-mode:lr-tb;text-anchor:middle;overflow:visible;fill:#4e9a06;stroke:none;stroke-width:1;stroke-linecap:round;stroke-linejoin:round;stroke-miterlimit:4;stroke-dasharray:none"
       x="529.13385"
       y="-117.16535"
       id="text2688"
       transform="translate(184.34731,258.28448)"><tspan
         sodipodi:role="line"
         id="tspan2686"
         x="529.13385"
         y="-117.16535">×2</tspan></text>
    <text
       id="text2974"
       y="-117.16535"
       x="642.51965"
       style="color:#000000;font-style:normal;font-variant:normal;font-weight:normal;font-stretch:normal;font-size:16px;line-height:26.6667px;font-family:'Komika Text';-inkscape-font-specification:'Komika Text';text-align:center;text-decoration:none;text-decoration-line:none;writing-mode:lr-tb;text-anchor:middle;overflow:visible;fill:#4e9a06;stroke:none;stroke-width:1;stroke-linecap:round;stroke-linejoin:round;stroke-miterlimit:4;stroke-dasharray:none"
       xml:space="preserve"
       transform="translate(184.34731,258.28448)"><tspan
         y="-117.16535"
         x="642.51965"
         id="tspan2972"
         sodipodi:role="line">×2</tspan></text>
    <text
       id="text8339"
       y="-147.40157"
       x="-113.38583"
       style="color:#000000;font-style:normal;font-variant:normal;font-weight:normal;font-stretch:normal;font-size:16px;line-height:16.5333px;font-family:'Komika Text';-inkscape-font-specification:'Komika Text';text-align:end;text-decoration:none;text-decoration-line:none;writing-mode:lr-tb;text-anchor:end;overflow:visible;fill:#4e9a06;stroke:none;stroke-width:1;stroke-linecap:round;stroke-linejoin:round;stroke-miterlimit:4;stroke-dasharray:none"
       xml:space="preserve"
       transform="translate(184.34731,258.28448)"><tspan
         y="-147.40157"
         x="-113.38583"
         id="tspan8337"
         sodipodi:role="line">Octaves</tspan></text>
    <text
       id="text8360"
       y="-222.99213"
       x="805.03937"
       style="color:#000000;font-style:normal;font-variant:normal;font-weight:normal;font-stretch:normal;font-size:16px;line-height:16.5333px;font-family:'Komika Text';-inkscape-font-specification:'Komika Text';text-align:end;text-decoration:none;text-decoration-line:none;writing-mode:lr-tb;text-anchor:end;overflow:visible;fill:#4e9a06;stroke:none;stroke-width:1;stroke-linecap:round;stroke-linejoin:round;stroke-miterlimit:4;stroke-dasharray:none"
       xml:space="preserve"
       transform="translate(184.34731,258.28448)"><tspan
         y="-222.99213"
         x="805.03937"
         id="tspan8358"
         sodipodi:role="line" /></text>
    <text
       id="text8400"
       y="-147.72734"
       x="788.29749"
       style="color:#000000;font-style:normal;font-variant:normal;font-weight:normal;font-stretch:normal;font-size:16px;line-height:16.5333px;font-family:'Komika Text';-inkscape-font-specification:'Komika Text';text-align:center;text-decoration:none;text-decoration-line:none;writing-mode:lr-tb;text-anchor:middle;overflow:visible;fill:#4e9a06;stroke:none;stroke-width:1;stroke-linecap:round;stroke-linejoin:round;stroke-miterlimit:4;stroke-dasharray:none"
       xml:space="preserve"
       transform="translate(184.34731,258.28448)"><tspan
         y="-147.72734"
         x="788.29749"
         id="tspan8398"
         sodipodi:role="line">2<tspan
   id="tspan8402"
   style="font-style:normal;font-variant:normal;font-weight:normal;font-stretch:normal;font-size:65%;font-family:'Komika Text';-inkscape-font-specification:'Komika Text';baseline-shift:super;fill:#4e9a06">7</tspan> = 128</tspan></text>
    <path
       style="fill:none;fill-rule:evenodd;stroke:#4e9a06;stroke-width:1;stroke-linecap:butt;stroke-linejoin:miter;stroke-miterlimit:4;stroke-dasharray:none;stroke-opacity:1"
       d="m -94.488191,-170.07874 v 7.55906"
       id="path127"
       inkscape:connector-curvature="0"
       transform="translate(184.34731,258.28448)" />
    <path
       inkscape:connector-curvature="0"
       id="path129"
       d="m 19.07805,-170.07874 v 7.55906"
       style="fill:none;fill-rule:evenodd;stroke:#4e9a06;stroke-width:1;stroke-linecap:butt;stroke-linejoin:miter;stroke-miterlimit:4;stroke-dasharray:none;stroke-opacity:1"
       transform="translate(184.34731,258.28448)" />
    <path
       style="fill:none;fill-rule:evenodd;stroke:#4e9a06;stroke-width:1;stroke-linecap:butt;stroke-linejoin:miter;stroke-miterlimit:4;stroke-dasharray:none;stroke-opacity:1"
       d="m 132.64431,-170.07874 v 7.55906"
       id="path131"
       inkscape:connector-curvature="0"
       transform="translate(184.34731,258.28448)" />
    <path
       inkscape:connector-curvature="0"
       id="path133"
       d="m 246.21057,-170.07874 v 7.55906"
       style="fill:none;fill-rule:evenodd;stroke:#4e9a06;stroke-width:1;stroke-linecap:butt;stroke-linejoin:miter;stroke-miterlimit:4;stroke-dasharray:none;stroke-opacity:1"
       transform="translate(184.34731,258.28448)" />
    <path
       style="fill:none;fill-rule:evenodd;stroke:#4e9a06;stroke-width:1;stroke-linecap:butt;stroke-linejoin:miter;stroke-miterlimit:4;stroke-dasharray:none;stroke-opacity:1"
       d="m 359.77684,-170.07874 v 7.55906"
       id="path135"
       inkscape:connector-curvature="0"
       transform="translate(184.34731,258.28448)" />
    <path
       inkscape:connector-curvature="0"
       id="path137"
       d="m 473.3431,-170.07874 v 7.55906"
       style="fill:none;fill-rule:evenodd;stroke:#4e9a06;stroke-width:1;stroke-linecap:butt;stroke-linejoin:miter;stroke-miterlimit:4;stroke-dasharray:none;stroke-opacity:1"
       transform="translate(184.34731,258.28448)" />
    <path
       style="fill:none;fill-rule:evenodd;stroke:#4e9a06;stroke-width:1;stroke-linecap:butt;stroke-linejoin:miter;stroke-miterlimit:4;stroke-dasharray:none;stroke-opacity:1"
       d="m 586.90937,-170.07874 v 7.55906"
       id="path139"
       inkscape:connector-curvature="0"
       transform="translate(184.34731,258.28448)" />
    <path
       inkscape:connector-curvature="0"
       id="path141"
       d="m 700.47562,-170.07874 v 7.55906"
       style="fill:none;fill-rule:evenodd;stroke:#4e9a06;stroke-width:1;stroke-linecap:butt;stroke-linejoin:miter;stroke-miterlimit:4;stroke-dasharray:none;stroke-opacity:1"
       transform="translate(184.34731,258.28448)" />
    <path
       style="fill:none;fill-rule:evenodd;stroke:#4e9a06;stroke-width:1;stroke-linecap:butt;stroke-linejoin:miter;stroke-miterlimit:4;stroke-dasharray:none;stroke-opacity:1"
       d="m 700.47562,-170.07874 v 7.55906"
       id="path143"
       inkscape:connector-curvature="0"
       transform="translate(184.34731,258.28448)" />
    <path
       sodipodi:nodetypes="cc"
       inkscape:connector-curvature="0"
       id="path1316"
       d="m -90.708663,-143.62204 c 18.897638,15.1181 86.929134,15.1181 105.826773,0"
       style="fill:none;fill-rule:evenodd;stroke:#4e9a06;stroke-width:1px;stroke-linecap:butt;stroke-linejoin:miter;stroke-opacity:1;marker-end:url(#Arrow2Mend)"
       transform="translate(184.34731,258.28448)" />
    <path
       style="fill:none;fill-rule:evenodd;stroke:#4e9a06;stroke-width:1px;stroke-linecap:butt;stroke-linejoin:miter;stroke-opacity:1;marker-end:url(#marker1688)"
       d="m 22.67716,-143.62204 c 18.89764,15.1181 86.92914,15.1181 105.82678,0"
       id="path1680"
       inkscape:connector-curvature="0"
       sodipodi:nodetypes="cc"
       transform="translate(184.34731,258.28448)" />
    <path
       sodipodi:nodetypes="cc"
       inkscape:connector-curvature="0"
       id="path1922"
       d="m 136.06299,-143.62204 c 18.89764,15.1181 86.92914,15.1181 105.82678,0"
       style="fill:none;fill-rule:evenodd;stroke:#4e9a06;stroke-width:1px;stroke-linecap:butt;stroke-linejoin:miter;stroke-opacity:1;marker-end:url(#marker1930)"
       transform="translate(184.34731,258.28448)" />
    <path
       style="fill:none;fill-rule:evenodd;stroke:#4e9a06;stroke-width:1px;stroke-linecap:butt;stroke-linejoin:miter;stroke-opacity:1;marker-end:url(#marker2222)"
       d="m 249.44882,-143.62204 c 18.89764,15.1181 86.92914,15.1181 105.82678,0"
       id="path2214"
       inkscape:connector-curvature="0"
       sodipodi:nodetypes="cc"
       transform="translate(184.34731,258.28448)" />
    <path
       sodipodi:nodetypes="cc"
       inkscape:connector-curvature="0"
       id="path2460"
       d="m 362.83465,-143.62204 c 18.89764,15.1181 86.92914,15.1181 105.82678,0"
       style="fill:none;fill-rule:evenodd;stroke:#4e9a06;stroke-width:1px;stroke-linecap:butt;stroke-linejoin:miter;stroke-opacity:1;marker-end:url(#marker2468)"
       transform="translate(184.34731,258.28448)" />
    <path
       style="fill:none;fill-rule:evenodd;stroke:#4e9a06;stroke-width:1px;stroke-linecap:butt;stroke-linejoin:miter;stroke-opacity:1;marker-end:url(#marker2692)"
       d="m 476.22048,-143.62204 c 18.89764,15.1181 86.92914,15.1181 105.82678,0"
       id="path2684"
       inkscape:connector-curvature="0"
       sodipodi:nodetypes="cc"
       transform="translate(184.34731,258.28448)" />
    <path
       sodipodi:nodetypes="cc"
       inkscape:connector-curvature="0"
       id="path2970"
       d="m 589.6063,-143.62204 c 18.89764,15.1181 86.92914,15.1181 105.82678,0"
       style="fill:none;fill-rule:evenodd;stroke:#4e9a06;stroke-width:1px;stroke-linecap:butt;stroke-linejoin:miter;stroke-opacity:1;marker-end:url(#marker2978)"
       transform="translate(184.34731,258.28448)" />
    <text
       id="text41"
       y="-181.41733"
       x="-94.48819"
       style="color:#000000;font-style:normal;font-variant:normal;font-weight:normal;font-stretch:normal;font-size:16px;line-height:26.6667px;font-family:'Komika Text';-inkscape-font-specification:'Komika Text';text-align:center;text-decoration:none;text-decoration-line:none;writing-mode:lr-tb;text-anchor:middle;overflow:visible;fill:#204a87;stroke-width:1.37953;stroke-linecap:round;stroke-linejoin:round"
       xml:space="preserve"
       transform="translate(184.34731,258.28448)"><tspan
         y="-181.41733"
         x="-94.48819"
         id="tspan39"
         sodipodi:role="line">fa</tspan></text>
    <text
       id="text45"
       y="-181.41733"
       x="-28.051949"
       style="color:#000000;font-style:normal;font-variant:normal;font-weight:normal;font-stretch:normal;font-size:16px;line-height:26.6667px;font-family:'Komika Text';-inkscape-font-specification:'Komika Text';text-align:center;text-decoration:none;text-decoration-line:none;writing-mode:lr-tb;text-anchor:middle;overflow:visible;fill:#204a87;stroke-width:1.37953;stroke-linecap:round;stroke-linejoin:round"
       xml:space="preserve"
       transform="translate(184.34731,258.28448)"><tspan
         y="-181.41733"
         x="-28.051949"
         id="tspan43"
         sodipodi:role="line">do</tspan></text>
    <text
       id="text49"
       y="-181.41733"
       x="38.144299"
       style="color:#000000;font-style:normal;font-variant:normal;font-weight:normal;font-stretch:normal;font-size:16px;line-height:26.6667px;font-family:'Komika Text';-inkscape-font-specification:'Komika Text';text-align:center;text-decoration:none;text-decoration-line:none;writing-mode:lr-tb;text-anchor:middle;overflow:visible;fill:#204a87;stroke-width:1.37953;stroke-linecap:round;stroke-linejoin:round"
       xml:space="preserve"
       transform="translate(184.34731,258.28448)"><tspan
         y="-181.41733"
         x="38.144299"
         id="tspan47"
         sodipodi:role="line">sol</tspan></text>
    <text
       id="text53"
       y="-181.41733"
       x="104.83658"
       style="color:#000000;font-style:normal;font-variant:normal;font-weight:normal;font-stretch:normal;font-size:16px;line-height:26.6667px;font-family:'Komika Text';-inkscape-font-specification:'Komika Text';text-align:center;text-decoration:none;text-decoration-line:none;writing-mode:lr-tb;text-anchor:middle;overflow:visible;fill:#204a87;stroke-width:1.37953;stroke-linecap:round;stroke-linejoin:round"
       xml:space="preserve"
       transform="translate(184.34731,258.28448)"><tspan
         y="-181.41733"
         x="104.83658"
         id="tspan51"
         sodipodi:role="line">ré</tspan></text>
    <text
       id="text57"
       y="-181.41733"
       x="171.17682"
       style="color:#000000;font-style:normal;font-variant:normal;font-weight:normal;font-stretch:normal;font-size:16px;line-height:26.6667px;font-family:'Komika Text';-inkscape-font-specification:'Komika Text';text-align:center;text-decoration:none;text-decoration-line:none;writing-mode:lr-tb;text-anchor:middle;overflow:visible;fill:#204a87;stroke-width:1.37953;stroke-linecap:round;stroke-linejoin:round"
       xml:space="preserve"
       transform="translate(184.34731,258.28448)"><tspan
         y="-181.41733"
         x="171.17682"
         id="tspan55"
         sodipodi:role="line">la</tspan></text>
    <text
       id="text61"
       y="-181.41733"
       x="237.6451"
       style="color:#000000;font-style:normal;font-variant:normal;font-weight:normal;font-stretch:normal;font-size:16px;line-height:26.6667px;font-family:'Komika Text';-inkscape-font-specification:'Komika Text';text-align:center;text-decoration:none;text-decoration-line:none;writing-mode:lr-tb;text-anchor:middle;overflow:visible;fill:#204a87;stroke-width:1.37953;stroke-linecap:round;stroke-linejoin:round"
       xml:space="preserve"
       transform="translate(184.34731,258.28448)"><tspan
         y="-181.41733"
         x="237.6451"
         id="tspan59"
         sodipodi:role="line">mi</tspan></text>
    <text
       id="text65"
       y="-181.41733"
       x="303.96936"
       style="color:#000000;font-style:normal;font-variant:normal;font-weight:normal;font-stretch:normal;font-size:16px;line-height:26.6667px;font-family:'Komika Text';-inkscape-font-specification:'Komika Text';text-align:center;text-decoration:none;text-decoration-line:none;writing-mode:lr-tb;text-anchor:middle;overflow:visible;fill:#204a87;stroke-width:1.37953;stroke-linecap:round;stroke-linejoin:round"
       xml:space="preserve"
       transform="translate(184.34731,258.28448)"><tspan
         y="-181.41733"
         x="303.96936"
         id="tspan63"
         sodipodi:role="line">si</tspan></text>
    <text
       id="text69"
       y="-181.41733"
       x="370.72638"
       style="color:#000000;font-style:normal;font-variant:normal;font-weight:normal;font-stretch:normal;font-size:16px;line-height:26.6667px;font-family:'Komika Text';-inkscape-font-specification:'Komika Text';text-align:center;text-decoration:none;text-decoration-line:none;writing-mode:lr-tb;text-anchor:middle;overflow:visible;fill:#204a87;stroke-width:1.37953;stroke-linecap:round;stroke-linejoin:round"
       xml:space="preserve"
       transform="translate(184.34731,258.28448)"><tspan
         y="-181.41733"
         x="370.72638"
         id="tspan67"
         sodipodi:role="line">fa<tspan
   id="tspan71"
   style="font-style:normal;font-variant:normal;font-weight:normal;font-stretch:normal;font-size:65%;font-family:'Komika Text';-inkscape-font-specification:'Komika Text';baseline-shift:super;fill:#204a87">#</tspan></tspan></text>
    <text
       id="text75"
       y="-181.41733"
       x="437.00266"
       style="color:#000000;font-style:normal;font-variant:normal;font-weight:normal;font-stretch:normal;font-size:16px;line-height:26.6667px;font-family:'Komika Text';-inkscape-font-specification:'Komika Text';text-align:center;text-decoration:none;text-decoration-line:none;writing-mode:lr-tb;text-anchor:middle;overflow:visible;fill:#204a87;stroke-width:1.37953;stroke-linecap:round;stroke-linejoin:round"
       xml:space="preserve"
       transform="translate(184.34731,258.28448)"><tspan
         y="-181.41733"
         x="437.00266"
         id="tspan73"
         sodipodi:role="line">do<tspan
   id="tspan77"
   style="font-style:normal;font-variant:normal;font-weight:normal;font-stretch:normal;font-size:65%;font-family:'Komika Text';-inkscape-font-specification:'Komika Text';baseline-shift:super;fill:#204a87">#</tspan></tspan></text>
    <text
       id="text81"
       y="-181.41733"
       x="503.40692"
       style="color:#000000;font-style:normal;font-variant:normal;font-weight:normal;font-stretch:normal;font-size:16px;line-height:26.6667px;font-family:'Komika Text';-inkscape-font-specification:'Komika Text';text-align:center;text-decoration:none;text-decoration-line:none;writing-mode:lr-tb;text-anchor:middle;overflow:visible;fill:#204a87;stroke-width:1.37953;stroke-linecap:round;stroke-linejoin:round"
       xml:space="preserve"
       transform="translate(184.34731,258.28448)"><tspan
         y="-181.41733"
         x="503.40692"
         id="tspan79"
         sodipodi:role="line">sol<tspan
   id="tspan83"
   style="font-style:normal;font-variant:normal;font-weight:normal;font-stretch:normal;font-size:65%;font-family:'Komika Text';-inkscape-font-specification:'Komika Text';baseline-shift:super;fill:#204a87">#</tspan></tspan></text>
    <text
       id="text87"
       y="-181.41733"
       x="569.95514"
       style="color:#000000;font-style:normal;font-variant:normal;font-weight:normal;font-stretch:normal;font-size:16px;line-height:26.6667px;font-family:'Komika Text';-inkscape-font-specification:'Komika Text';text-align:center;text-decoration:none;text-decoration-line:none;writing-mode:lr-tb;text-anchor:middle;overflow:visible;fill:#204a87;stroke-width:1.37953;stroke-linecap:round;stroke-linejoin:round"
       xml:space="preserve"
       transform="translate(184.34731,258.28448)"><tspan
         y="-181.41733"
         x="569.95514"
         id="tspan85"
         sodipodi:role="line">ré<tspan
   id="tspan89"
   style="font-style:normal;font-variant:normal;font-weight:normal;font-stretch:normal;font-size:65%;font-family:'Komika Text';-inkscape-font-specification:'Komika Text';baseline-shift:super;fill:#204a87">#</tspan></tspan></text>
    <text
       id="text93"
       y="-181.41733"
       x="636.47137"
       style="color:#000000;font-style:normal;font-variant:normal;font-weight:normal;font-stretch:normal;font-size:16px;line-height:26.6667px;font-family:'Komika Text';-inkscape-font-specification:'Komika Text';text-align:center;text-decoration:none;text-decoration-line:none;writing-mode:lr-tb;text-anchor:middle;overflow:visible;fill:#204a87;stroke-width:1.37953;stroke-linecap:round;stroke-linejoin:round"
       xml:space="preserve"
       transform="translate(184.34731,258.28448)"><tspan
         y="-181.41733"
         x="636.47137"
         id="tspan91"
         sodipodi:role="line">la<tspan
   id="tspan95"
   style="font-style:normal;font-variant:normal;font-weight:normal;font-stretch:normal;font-size:65%;font-family:'Komika Text';-inkscape-font-specification:'Komika Text';baseline-shift:super;fill:#204a87">#</tspan></tspan></text>
    <path
       inkscape:connector-curvature="0"
       id="path101"
       d="m -94.488191,-177.63779 v 7.55905"
       style="fill:none;fill-rule:evenodd;stroke:#204a87;stroke-width:1;stroke-linecap:butt;stroke-linejoin:miter;stroke-miterlimit:4;stroke-dasharray:none;stroke-opacity:1"
       transform="translate(184.34731,258.28448)" />
    <path
       style="fill:none;fill-rule:evenodd;stroke:#204a87;stroke-width:1;stroke-linecap:butt;stroke-linejoin:miter;stroke-miterlimit:4;stroke-dasharray:none;stroke-opacity:1"
       d="m -28.051937,-177.63779 v 7.55905"
       id="path103"
       inkscape:connector-curvature="0"
       transform="translate(184.34731,258.28448)" />
    <path
       style="fill:none;fill-rule:evenodd;stroke:#204a87;stroke-width:1;stroke-linecap:butt;stroke-linejoin:miter;stroke-miterlimit:4;stroke-dasharray:none;stroke-opacity:1"
       d="m 38.38432,-177.63779 v 7.55905"
       id="path105"
       inkscape:connector-curvature="0"
       transform="translate(184.34731,258.28448)" />
    <path
       style="fill:none;fill-rule:evenodd;stroke:#204a87;stroke-width:1;stroke-linecap:butt;stroke-linejoin:miter;stroke-miterlimit:4;stroke-dasharray:none;stroke-opacity:1"
       d="m 104.82058,-177.63779 v 7.55905"
       id="path107"
       inkscape:connector-curvature="0"
       transform="translate(184.34731,258.28448)" />
    <path
       style="fill:none;fill-rule:evenodd;stroke:#204a87;stroke-width:1;stroke-linecap:butt;stroke-linejoin:miter;stroke-miterlimit:4;stroke-dasharray:none;stroke-opacity:1"
       d="m 171.25683,-177.63779 v 7.55905"
       id="path109"
       inkscape:connector-curvature="0"
       transform="translate(184.34731,258.28448)" />
    <path
       style="fill:none;fill-rule:evenodd;stroke:#204a87;stroke-width:1;stroke-linecap:butt;stroke-linejoin:miter;stroke-miterlimit:4;stroke-dasharray:none;stroke-opacity:1"
       d="m 237.69309,-177.63779 v 7.55905"
       id="path111"
       inkscape:connector-curvature="0"
       transform="translate(184.34731,258.28448)" />
    <path
       style="fill:none;fill-rule:evenodd;stroke:#204a87;stroke-width:1;stroke-linecap:butt;stroke-linejoin:miter;stroke-miterlimit:4;stroke-dasharray:none;stroke-opacity:1"
       d="m 304.12937,-177.63779 v 7.55905"
       id="path113"
       inkscape:connector-curvature="0"
       transform="translate(184.34731,258.28448)" />
    <path
       style="fill:none;fill-rule:evenodd;stroke:#204a87;stroke-width:1;stroke-linecap:butt;stroke-linejoin:miter;stroke-miterlimit:4;stroke-dasharray:none;stroke-opacity:1"
       d="m 370.5656,-177.63779 v 7.55905"
       id="path115"
       inkscape:connector-curvature="0"
       transform="translate(184.34731,258.28448)" />
    <path
       style="fill:none;fill-rule:evenodd;stroke:#204a87;stroke-width:1;stroke-linecap:butt;stroke-linejoin:miter;stroke-miterlimit:4;stroke-dasharray:none;stroke-opacity:1"
       d="m 437.00187,-177.63779 v 7.55905"
       id="path117"
       inkscape:connector-curvature="0"
       transform="translate(184.34731,258.28448)" />
    <path
       style="fill:none;fill-rule:evenodd;stroke:#204a87;stroke-width:1;stroke-linecap:butt;stroke-linejoin:miter;stroke-miterlimit:4;stroke-dasharray:none;stroke-opacity:1"
       d="m 503.43814,-177.63779 v 7.55905"
       id="path119"
       inkscape:connector-curvature="0"
       transform="translate(184.34731,258.28448)" />
    <path
       style="fill:none;fill-rule:evenodd;stroke:#204a87;stroke-width:1;stroke-linecap:butt;stroke-linejoin:miter;stroke-miterlimit:4;stroke-dasharray:none;stroke-opacity:1"
       d="m 569.87437,-177.63779 v 7.55905"
       id="path121"
       inkscape:connector-curvature="0"
       transform="translate(184.34731,258.28448)" />
    <path
       style="fill:none;fill-rule:evenodd;stroke:#204a87;stroke-width:1;stroke-linecap:butt;stroke-linejoin:miter;stroke-miterlimit:4;stroke-dasharray:none;stroke-opacity:1"
       d="m 636.31064,-177.63779 v 7.55905"
       id="path123"
       inkscape:connector-curvature="0"
       transform="translate(184.34731,258.28448)" />
    <path
       style="fill:none;fill-rule:evenodd;stroke:#204a87;stroke-width:1;stroke-linecap:butt;stroke-linejoin:miter;stroke-miterlimit:4;stroke-dasharray:none;stroke-opacity:1"
       d="m 702.74688,-177.63779 v 7.55905"
       id="path125"
       inkscape:connector-curvature="0"
       transform="translate(184.34731,258.28448)" />
    <text
       id="text147"
       y="-181.41733"
       x="702.66687"
       style="color:#000000;font-style:normal;font-variant:normal;font-weight:normal;font-stretch:normal;font-size:16px;line-height:26.6667px;font-family:'Komika Text';-inkscape-font-specification:'Komika Text';text-align:center;text-decoration:none;text-decoration-line:none;writing-mode:lr-tb;text-anchor:middle;overflow:visible;fill:#204a87;stroke-width:1.37953;stroke-linecap:round;stroke-linejoin:round"
       xml:space="preserve"
       transform="translate(184.34731,258.28448)"><tspan
         y="-181.41733"
         x="702.66687"
         id="tspan145"
         sodipodi:role="line">fa</tspan></text>
  </g>
</svg>
