{
    "general": {
        "identifier": {
            "catalog": "ark",
            "entry": "ark:/54037/lmnd222r17sm"
        },
        "title": {
            "string": "Lumni Enseignement"
        },
        "language": "http://id.loc.gov/vocabulary/iso639-2/fre",
        "description": {
            "string": "Des milliers de ressources (vidéos, audios, images, pistes pédagogiques...), issues des grandes institutions culturelles et scientifiques, pour les enseignants et les élèves du primaire à la terminale."
        },
        "keyword": [
            {
                "string": "vidéo"
            },
            {
                "string": "audio"
            },
            {
                "string": "télévision"
            },
            {
                "string": "Arte"
            },
            {
                "string": "TV5monde"
            },
            {
                "string": "RFI"
            },
            {
                "string": "Réseau Canopé"
            },
            {
                "string": "INA"
            },
            {
                "string": "France télévisions"
            },
            {
                "string": "Jalons"
            },
            {
                "string": "Radio France"
            },
            {
                "string": "vidéo pédagogique"
            },
            {
                "string": "pédagogie"
            },
            {
                "string": "histoire"
            },
            {
                "string": "cité"
            },
            {
                "string": "monde"
            },
            {
                "string": "stade"
            },
            {
                "string": "lettres"
            },
            {
                "string": "sciences"
            },
            {
                "string": "arts"
            },
            {
                "string": "chronologie"
            },
            {
                "string": "archives"
            },
            {
                "string": "éducation"
            },
            {
                "string": "culture"
            },
            {
                "string": "pistes pédagogiques"
            }
        ],
        "structure": {
            "source": "SCOLOMFRv1.0",
            "value": "http://data.education.fr/voc/scolomfr/concept/collection_2",
            "label": "collection"
        },
        "documentType": {
            "source": "SCOLOMFRv2.0",
            "value": "http://purl.org/dc/dcmitype/Collection",
            "label": "collection"
        },
        "generalResourceType": [
            {
                "source": "LOMv1.0",
                "value": "http://data.education.fr/voc/scolomfr/concept/scolomfr-voc-005-num-002",
                "label": "archives"
            },
            {
                "source": "LOMv1.0",
                "value": "http://data.education.fr/voc/scolomfr/concept/scolomfr-voc-005-num-006",
                "label": "banque de vidéos"
            },
            {
                "source": "LOMv1.0",
                "value": "http://data.education.fr/voc/scolomfr/concept/scolomfr-voc-005-num-051",
                "label": "banque de sons"
            }
        ]
    },
    "lifeCycle": {
        "status": {
            "source": "SCOLOMFRv2.0",
            "value": "http://data.education.fr/voc/scolomfr/concept/final",
            "label": "final"
        },
        "contribute": [
            {
                "role": {
                    "source": "SCOLOMFRv2.1",
                    "value": "http://data.education.fr/voc/scolomfr/concept/publisher",
                    "label": "Éditeur"
                },
                "entity": "\r\n                \r\nBEGIN:VCARD\r\nVERSION:4.0\r\nKIND:org\r\nFN:INSTITUT NATIONAL DE L'AUDIOVISUEL (INA)\r\nN:;;;;\r\nORG:INSTITUT NATIONAL DE L'AUDIOVISUEL\r\nADR:;;4 avenue de l'Europe;Bry-sur-Marne;94366 Cedex;;France\r\nTEL:01 49 83 20 00\r\nEMAIL:enseignants-lumni@ina.fr\r\nLOGO:http://www.institut-national-audiovisuel.fr/images/header/logo-ina-header.png\r\nNOTE:SIREN=302421193\r\nNOTE:ISNI=0000 0001 2243 3761\r\nUID:http://isni.org/isni/0000000122433761\r\nNOTE:Contact=http://www.institut-national-audiovisuel.fr\r\nURL:http://www.institut-national-audiovisuel.fr\r\nREV:20191105\r\nEND:VCARD\r\n\r\n                \r\n            ",
                "date": {
                    "dateTime": "2019-11-05"
                }
            },
            {
                "role": {
                    "source": "SCOLOMFRv2.1",
                    "value": "http://data.education.fr/voc/scolomfr/concept/scolomfr-voc-003-num-017",
                    "label": "diffuseur / distributeur"
                },
                "entity": "\r\n                   \r\nBEGIN:VCARD\r\nVERSION:4.0\r\nKIND:org\r\nFN:INSTITUT NATIONAL DE L'AUDIOVISUEL (INA)\r\nN:;;;;\r\nORG:INSTITUT NATIONAL DE L'AUDIOVISUEL\r\nADR:;;4 avenue de l'Europe;Bry-sur-Marne;94366 Cedex;;France\r\nTEL:01 49 83 20 00\r\nEMAIL:enseignants-lumni@ina.fr\r\nLOGO:http://www.institut-national-audiovisuel.fr/images/header/logo-ina-header.png\r\nNOTE:SIREN=302421193\r\nNOTE:ISNI=0000 0001 2243 3761\r\nUID:http://isni.org/isni/0000000122433761\r\nNOTE:Contact=http://www.institut-national-audiovisuel.fr\r\nURL:http://www.institut-national-audiovisuel.fr\r\nREV:20191107\r\nEND:VCARD\r\n\r\n            ",
                "date": {
                    "dateTime": "2019-11-05",
                    "description": {
                        "string": "GAR : distributeur technique"
                    }
                }
            },
            {
                "role": {
                    "source": "SCOLOMFRv2.1",
                    "value": "http://data.education.fr/voc/scolomfr/concept/scolomfr-voc-003-num-017",
                    "label": "diffuseur / distributeur"
                },
                "entity": "\r\n                \r\nBEGIN:VCARD\r\nVERSION:4.0\r\nFN: Ministère de l'Education Nationale - Eduthèque\r\nORG: Ministère de l'Education Nationale\r\nNOTE:SIREN=110043015\r\nNOTE:ISNI=0000000121920322\r\nNOTE:DNE\r\nNOTE:Eduthèque\r\nEMAIL:Edutheque-GAR@education.gouv.fr\r\nREV:2018-01-27\r\nEND:VCARD\r\n ",
                "date": {
                    "dateTime": "2018-01-27",
                    "description": {
                        "string": "GAR : distributeur commercial"
                    }
                }
            },
            {
                "role": {
                    "source": "SCOLOMFRv2.1",
                    "value": "http://data.education.fr/voc/scolomfr/concept/scolomfr-voc-003-num-017",
                    "label": "diffuseur / distributeur"
                },
                "entity": "\r\n              \r\nBEGIN:VCARD\r\nVERSION:4.0\r\nKIND:org\r\nFN:EFFIOS\r\nADR:;;76 rue de Passy;Paris;75016;;France\r\nTEL:(33)6-08-23-57-44\r\nEMAIL:gpuimatto@effios.fr\r\nNOTE:SIREN=511083743\r\nNOTE:ISNI=0000000073624720\r\nNOTE:Effios opérateur DCR du MEN pour Eduthèque et BRNE\r\nORG:EFFIOS\r\nURL:http://www.effios.fr\r\nREV:2018-01-29\r\nEND:VCARD\r\n\r\n     ",
                "date": {
                    "dateTime": "2018-01-27",
                    "description": {
                        "string": "GAR : distributeur commercial"
                    }
                }
            },
            {
                "role": {
                    "source": "SCOLOMFRv2.1",
                    "value": "http://data.education.fr/voc/scolomfr/concept/technical_validator",
                    "label": "valideur technique"
                },
                "entity": "\r\n                        \r\nBEGIN:VCARD\r\nVERSION:4.0\r\nKIND:org\r\nFN:INSTITUT NATIONAL DE L'AUDIOVISUEL (INA)\r\nN:;;;;\r\nORG:INSTITUT NATIONAL DE L'AUDIOVISUEL\r\nADR:;;4 avenue de l'Europe;Bry-sur-Marne;94366 Cedex;;France\r\nTEL:01 49 83 20 00\r\nEMAIL:enseignants-lumni@ina.fr\r\nLOGO:http://www.institut-national-audiovisuel.fr/images/header/logo-ina-header.png\r\nNOTE:SIREN=302421193\r\nNOTE:ISNI=0000 0001 2243 3761\r\nUID:http://isni.org/isni/0000000122433761\r\nNOTE:Contact=http://www.institut-national-audiovisuel.fr\r\nURL:http://www.institut-national-audiovisuel.fr\r\nREV:20191107\r\nEND:VCARD\r\n \r\n            ",
                "date": {
                    "dateTime": "2022-10-17",
                    "description": {
                        "string": "GAR : validation technique"
                    }
                }
            }
        ]
    },
    "metaMetadata": {
        "identifier": {
            "catalog": "http://fresques.ina.fr/oai",
            "entry": "oai:enseignants.lumni.fr:lmnd222r17sm"
        },
        "contribute": {
            "role": {
                "source": "SCOLOMFRv2.0",
                "value": "http://data.education.fr/voc/scolomfr/concept/creator",
                "label": "créateur"
            },
            "entity": "\r\n                  \r\nBEGIN:VCARD\r\nVERSION:4.0\r\nKIND:org\r\nFN:INSTITUT NATIONAL DE L'AUDIOVISUEL (INA)\r\nN:;;;;\r\nORG:INSTITUT NATIONAL DE L'AUDIOVISUEL\r\nADR:;;4 avenue de l'Europe;Bry-sur-Marne;94366 Cedex;;France\r\nTEL:01 49 83 20 00\r\nEMAIL:enseignants-lumni@ina.fr\r\nLOGO:http://www.institut-national-audiovisuel.fr/images/header/logo-ina-header.png\r\nNOTE:SIREN=302421193\r\nNOTE:ISNI=0000 0001 2243 3761\r\nUID:http://isni.org/isni/0000000122433761\r\nNOTE:Contact=http://www.institut-national-audiovisuel.fr\r\nURL:http://www.institut-national-audiovisuel.fr\r\nREV:20191105\r\nEND:VCARD\r\n\r\n\r\n            ",
            "date": {
                "dateTime": "2019-01-05",
                "description": {
                    "string": "Prototype fiche Scolomfr pour le GAR"
                }
            }
        },
        "metadataSchema": "SCOLOMFR V2.1",
        "language": "http://id.loc.gov/vocabulary/iso639-2/fre"
    },
    "technical": {
        "format": [
            "http://purl.org/NET/mediatypes/video/mp4",
            " http://purl.org/NET/mediatypes/text/html"
        ],
        "location": "https://enseignants.lumni.fr",
        "extendedLocation": {
            "location": "https://enseignants.lumni.fr/sso-gar",
            "platform": "http://data.education.fr/gar",
            "personalDataProcessType": {
                "source": "SCOLOMFRv2.1",
                "value": "\r\n                http://data.education.fr/voc/scolomfr/concept/scolomfr-voc-044-num-003\r\n            ",
                "label": "personnalisation moyenne : les données transférées ne permettent pas d'identifier directement l'utilisateur "
            },
            "description": {
                "string": "Attributs GAR : [UAI] Code établissement ; [IDO] Id opaque ; [PRO] Profil ; [idENT] Code projet ENT "
            }
        }
    },
    "educational": {
        "intendedEndUserRole": [
            {
                "source": "SCOLOMFRv2.1",
                "value": "http://data.education.fr/voc/scolomfr/concept/learner",
                "label": "apprenant"
            },
            {
                "source": "SCOLOMFRv2.1",
                "value": "http://data.education.fr/voc/scolomfr/concept/teacher",
                "label": "enseignant"
            }
        ],
        "context": [
            {
                "source": "SCOLOMFRv2.1",
                "value": "http://data.education.fr/voc/scolomfr/concept/scolomfr-voc-012-num-003",
                "label": "enseignement secondaire"
            },
            {
                "source": "SCOLOMFRv2.1",
                "value": "http://data.education.fr/voc/scolomfr/concept/scolomfr-voc-012-num-002",
                "label": "enseignement primaire"
            }
        ]
    },
    "rights": {
        "cost": {
            "source": "SCOLOMFRv2.1",
            "value": "http://data.education.fr/voc/scolomfr/concept/no",
            "label": "non"
        },
        "copyrightAndOtherRestrictions": {
            "source": "SCOLOMFRv2.1",
            "value": "http://data.education.fr/voc/scolomfr/concept/yes_2",
            "label": "oui"
        },
        "description": {
            "string": "\r\n            Institut national de l'audiovisuel, tous droits réservés.\r\n            Conditions générales d'utilisation : https://enseignants.lumni.fr/annexe/cgu\r\n            Informations légales : https://enseignants.lumni.fr/annexe/mentions-legales\r\n            Charte pour la vie privée: https://enseignants.lumni.fr/annexe/charte-vie-privee\r\n            Accès intégral sur http://www.edutheque.fr\r\n        "
        }
    },
    "relation": {
        "kind": {
            "source": "SCOLOMFRv2.1",
            "value": "http://data.education.fr/voc/scolomfr/concept/scolomfr-voc-009-num-021",
            "label": "a pour vignette"
        },
        "resource": {
            "identifier": {
                "catalog": "URI",
                "entry": "https://enseignants.lumni.fr/images_v5/ressource/lumni/images/refonte/logos/lumni_enseignement-gar.jpg"
            },
            "description": {
                "string": "jpg 400x400"
            }
        }
    },
    "classification": [
        {
            "purpose": {
                "source": "SCOLOMFRv2.1",
                "value": "http://data.education.fr/voc/scolomfr/concept/scolomfr-voc-028-num-011",
                "label": "public cible détaillé"
            },
            "taxonPath": {
                "source": {
                    "string": "SCOLOMFRv2.1 ; scolomfr-voc-021 ; Public cible détaillé"
                },
                "taxon": [
                    {
                        "id": "http://data.education.fr/voc/scolomfr/concept/scolomfr-voc-021-num-0007",
                        "entry": {
                            "string": "élève"
                        }
                    },
                    {
                        "id": "http://data.education.fr/voc/scolomfr/concept/scolomfr-voc-021-num-0009",
                        "entry": {
                            "string": "enseignant des disciplines"
                        }
                    },
                    {
                        "id": "http://data.education.fr/voc/scolomfr/concept/scolomfr-voc-021-num-0010",
                        "entry": {
                            "string": "enseignant documentaliste"
                        }
                    },
                    {
                        "id": "http://data.education.fr/voc/scolomfr/concept/scolomfr-voc-021-num-0023",
                        "entry": {
                            "string": "professeur des écoles"
                        }
                    }
                ]
            }
        },
        {
            "purpose": {
                "source": "SCOLOMFRv2.1",
                "value": " http://data.education.fr/voc/scolomfr/concept/scolomfr-voc-028-num-003",
                "label": "domaine d'enseignement "
            },
            "taxonPath": {
                "source": {
                    "string": "SCOLOMFRv3.0 ; scolomfr-voc-015 ; Enseignement"
                },
                "taxon": [
                    {
                        "id": " http://data.education.fr/voc/scolomfr/concept/scolomfr-voc-015-num-1391",
                        "entry": {
                            "string": "français (cycle 4) "
                        }
                    },
                    {
                        "id": " http://data.education.fr/voc/scolomfr/concept/scolomfr-voc-015-num-1229",
                        "entry": {
                            "string": "histoire des arts (cycle 4) "
                        }
                    },
                    {
                        "id": " http://data.education.fr/voc/scolomfr/concept/scolomfr-voc-015-num-981",
                        "entry": {
                            "string": "histoire et géographie (cycle 3) "
                        }
                    },
                    {
                        "id": " http://data.education.fr/voc/scolomfr/concept/scolomfr-voc-015-num-1007",
                        "entry": {
                            "string": "histoire et géographie (cycle 4) "
                        }
                    },
                    {
                        "id": " http://data.education.fr/voc/scolomfr/concept/scolomfr-voc-015-num-6310",
                        "entry": {
                            "string": "langues et cultures de l'Antiquité (enseignement facultatif cycle 4) "
                        }
                    },
                    {
                        "id": " http://data.education.fr/voc/scolomfr/concept/scolomfr-voc-015-num-1440",
                        "entry": {
                            "string": "langues vivantes étrangères ou régionales (cycle 3)  "
                        }
                    },
                    {
                        "id": " http://data.education.fr/voc/scolomfr/concept/scolomfr-voc-015-num-1460",
                        "entry": {
                            "string": "langues vivantes étrangères ou régionales (cycle 4)   "
                        }
                    },
                    {
                        "id": " http://data.education.fr/voc/scolomfr/concept/scolomfr-voc-015-num-934",
                        "entry": {
                            "string": "mathématiques (cycle 3)   "
                        }
                    },
                    {
                        "id": "http://data.education.fr/voc/scolomfr/concept/scolomfr-voc-015-num-947",
                        "entry": {
                            "string": "mathématiques (cycle 4) "
                        }
                    },
                    {
                        "id": "http://data.education.fr/voc/scolomfr/concept/scolomfr-voc-015-num-1496",
                        "entry": {
                            "string": "physique-chimie (cycle 4) "
                        }
                    },
                    {
                        "id": " http://data.education.fr/voc/scolomfr/concept/scolomfr-voc-015-num-1511 ",
                        "entry": {
                            "string": "sciences de la vie et de la Terre (cycle 4) "
                        }
                    },
                    {
                        "id": "http://data.education.fr/voc/scolomfr/concept/scolomfr-voc-015-num-1474",
                        "entry": {
                            "string": "sciences et technologie (cycle 3)  "
                        }
                    },
                    {
                        "id": "http://data.education.fr/voc/scolomfr/concept/scolomfr-voc-015-num-6171",
                        "entry": {
                            "string": "sciences et technologie\r\n "
                        }
                    },
                    {
                        "id": "http://data.education.fr/voc/scolomfr/concept/scolomfr-voc-015-num-1534",
                        "entry": {
                            "string": "technologie (cycle 4)  "
                        }
                    },
                    {
                        "id": "http://data.education.fr/voc/scolomfr/concept/scolomfr-voc-015-num-638",
                        "entry": {
                            "string": "arts du cirque (enseignement de spécialité)"
                        }
                    },
                    {
                        "id": "http://data.education.fr/voc/scolomfr/concept/scolomfr-voc-015-num-6383",
                        "entry": {
                            "string": "arts du cirque (enseignement optionnel)"
                        }
                    },
                    {
                        "id": "http://data.education.fr/voc/scolomfr/concept/scolomfr-voc-015-num-5697",
                        "entry": {
                            "string": "arts plastiques (enseignement de spécialité)"
                        }
                    },
                    {
                        "id": "http://data.education.fr/voc/scolomfr/concept/scolomfr-voc-015-num-6384",
                        "entry": {
                            "string": "arts plastiques (enseignement optionnel)"
                        }
                    },
                    {
                        "id": "http://data.education.fr/voc/scolomfr/concept/scolomfr-voc-015-num-4549",
                        "entry": {
                            "string": "biochimie-biologie (enseignement de spécialité)"
                        }
                    },
                    {
                        "id": "http://data.education.fr/voc/scolomfr/concept/scolomfr-voc-015-num-6370",
                        "entry": {
                            "string": "biotechnologies (enseignement de spécialité)"
                        }
                    },
                    {
                        "id": "http://data.education.fr/voc/scolomfr/concept/scolomfr-voc-015-num-010",
                        "entry": {
                            "string": "biotechnologies (enseignement optionnel)"
                        }
                    },
                    {
                        "id": "http://data.education.fr/voc/scolomfr/concept/scolomfr-voc-015-num-013",
                        "entry": {
                            "string": "cinéma-audiovisuel (enseignement optionnel)"
                        }
                    },
                    {
                        "id": "http://data.education.fr/voc/scolomfr/concept/scolomfr-voc-015-num-017",
                        "entry": {
                            "string": "création et culture-design (enseignement optionnel)"
                        }
                    },
                    {
                        "id": "http://data.education.fr/voc/scolomfr/concept/scolomfr-voc-015-num-018",
                        "entry": {
                            "string": "création et innovation technologiques et sciences de l'ingénieur (enseignement optionnel)"
                        }
                    },
                    {
                        "id": "http://data.education.fr/voc/scolomfr/concept/scolomfr-voc-015-num-5783",
                        "entry": {
                            "string": "danse (enseignement de spécialité)"
                        }
                    },
                    {
                        "id": "http://data.education.fr/voc/scolomfr/concept/scolomfr-voc-015-num-019",
                        "entry": {
                            "string": "danse (enseignement optionnel)"
                        }
                    },
                    {
                        "id": "http://data.education.fr/voc/scolomfr/concept/scolomfr-voc-015-num-6371",
                        "entry": {
                            "string": "design et métiers d'art (enseignement de spécialité)"
                        }
                    },
                    {
                        "id": "http://data.education.fr/voc/scolomfr/concept/scolomfr-voc-015-num-137",
                        "entry": {
                            "string": "éducation aux médias et à l'information (lycée 2015)"
                        }
                    },
                    {
                        "id": "http://data.education.fr/voc/scolomfr/concept/scolomfr-voc-015-num-1839",
                        "entry": {
                            "string": "éducation physique et sportive (enseignement commun)"
                        }
                    },
                    {
                        "id": "http://data.education.fr/voc/scolomfr/concept/scolomfr-voc-015-num-6386",
                        "entry": {
                            "string": "éducation physique et sportive (enseignement optionnel)"
                        }
                    },
                    {
                        "id": "http://data.education.fr/voc/scolomfr/concept/scolomfr-voc-015-num-028",
                        "entry": {
                            "string": "enseignement moral et civique (enseignement commun)"
                        }
                    },
                    {
                        "id": "http://data.education.fr/voc/scolomfr/concept/scolomfr-voc-015-num-5819",
                        "entry": {
                            "string": "enseignement scientifique (enseignement commun)"
                        }
                    },
                    {
                        "id": "http://data.education.fr/voc/scolomfr/concept/scolomfr-voc-015-num-1840",
                        "entry": {
                            "string": "français (enseignement commun)"
                        }
                    },
                    {
                        "id": "http://data.education.fr/voc/scolomfr/concept/scolomfr-voc-015-num-1841",
                        "entry": {
                            "string": "histoire des arts (enseignement optionnel)"
                        }
                    },
                    {
                        "id": "http://data.education.fr/voc/scolomfr/concept/scolomfr-voc-015-num-6387",
                        "entry": {
                            "string": "histoire des arts (enseignement optionnel)"
                        }
                    },
                    {
                        "id": "http://data.education.fr/voc/scolomfr/concept/scolomfr-voc-015-num-1842",
                        "entry": {
                            "string": "histoire et géographie (enseignement commun)"
                        }
                    },
                    {
                        "id": "http://data.education.fr/voc/scolomfr/concept/scolomfr-voc-015-num-6372",
                        "entry": {
                            "string": "histoire-géographie, géopolitique et sciences politiques (enseignement de spécialité)"
                        }
                    },
                    {
                        "id": "http://data.education.fr/voc/scolomfr/concept/scolomfr-voc-015-num-6373",
                        "entry": {
                            "string": "humanités, littérature et philosophie (enseignement de spécialité)"
                        }
                    },
                    {
                        "id": "http://data.education.fr/voc/scolomfr/concept/scolomfr-voc-015-num-6374",
                        "entry": {
                            "string": "ingénierie et développement durable (enseignement de spécialité)"
                        }
                    },
                    {
                        "id": "http://data.education.fr/voc/scolomfr/concept/scolomfr-voc-015-num-7695",
                        "entry": {
                            "string": "langues, littératures et cultures étrangères - allemand (enseignement de spécialité)"
                        }
                    },
                    {
                        "id": "http://data.education.fr/voc/scolomfr/concept/scolomfr-voc-015-num-6353",
                        "entry": {
                            "string": "mathématiques 2de STHR (enseignement commun)"
                        }
                    },
                    {
                        "id": "http://data.education.fr/voc/scolomfr/concept/scolomfr-voc-015-num-1843",
                        "entry": {
                            "string": "mathématiques (enseignement commun)"
                        }
                    },
                    {
                        "id": "http://data.education.fr/voc/scolomfr/concept/scolomfr-voc-015-num-649",
                        "entry": {
                            "string": "mathématiques (enseignement de spécialité)"
                        }
                    },
                    {
                        "id": "http://data.education.fr/voc/scolomfr/concept/scolomfr-voc-015-num-5970",
                        "entry": {
                            "string": "mathématiques, physique-chimie (enseignement de spécialité)"
                        }
                    },
                    {
                        "id": "http://data.education.fr/voc/scolomfr/concept/scolomfr-voc-015-num-5997",
                        "entry": {
                            "string": "musique (enseignement de spécialité)"
                        }
                    },
                    {
                        "id": "http://data.education.fr/voc/scolomfr/concept/scolomfr-voc-015-num-6389",
                        "entry": {
                            "string": "musique (enseignement optionnel)"
                        }
                    },
                    {
                        "id": "http://data.education.fr/voc/scolomfr/concept/scolomfr-voc-015-num-7760",
                        "entry": {
                            "string": "numérique et sciences informatiques (enseignement de spécialité)"
                        }
                    },
                    {
                        "id": "http://data.education.fr/voc/scolomfr/concept/scolomfr-voc-015-num-656",
                        "entry": {
                            "string": "physique-chimie (enseignement de spécialité)"
                        }
                    },
                    {
                        "id": "http://data.education.fr/voc/scolomfr/concept/scolomfr-voc-015-num-6376",
                        "entry": {
                            "string": "physique-chimie et mathématiques (spécialité)"
                        }
                    },
                    {
                        "id": "http://data.education.fr/voc/scolomfr/concept/scolomfr-voc-015-num-1844",
                        "entry": {
                            "string": "physique-chimie (lycée 2015)"
                        }
                    },
                    {
                        "id": "http://data.education.fr/voc/scolomfr/concept/scolomfr-voc-015-num-6378",
                        "entry": {
                            "string": "physique-chimie STD2A (enseignement de spécialité)"
                        }
                    },
                    {
                        "id": "http://data.education.fr/voc/scolomfr/concept/scolomfr-voc-015-num-065",
                        "entry": {
                            "string": "santé et social (enseignement optionnel)"
                        }
                    },
                    {
                        "id": "http://data.education.fr/voc/scolomfr/concept/scolomfr-voc-015-num-1845",
                        "entry": {
                            "string": "sciences de la vie et de la Terre (enseignement commun)"
                        }
                    },
                    {
                        "id": "http://data.education.fr/voc/scolomfr/concept/scolomfr-voc-015-num-6380",
                        "entry": {
                            "string": "sciences de la vie et de la Terre (enseignement de spécialité)"
                        }
                    },
                    {
                        "id": "http://data.education.fr/voc/scolomfr/concept/scolomfr-voc-015-num-068",
                        "entry": {
                            "string": "sciences de l'ingénieur (enseignement de spécialité)"
                        }
                    },
                    {
                        "id": "http://data.education.fr/voc/scolomfr/concept/scolomfr-voc-015-num-070",
                        "entry": {
                            "string": "sciences économiques et sociales (enseignement commun)"
                        }
                    },
                    {
                        "id": "http://data.education.fr/voc/scolomfr/concept/scolomfr-voc-015-num-6071",
                        "entry": {
                            "string": "sciences économiques et sociales (enseignement de spécialité)"
                        }
                    },
                    {
                        "id": "http://data.education.fr/voc/scolomfr/concept/scolomfr-voc-015-num-071",
                        "entry": {
                            "string": "sciences et laboratoire"
                        }
                    },
                    {
                        "id": "http://data.education.fr/voc/scolomfr/concept/scolomfr-voc-015-num-072",
                        "entry": {
                            "string": "sciences et techniques sanitaires et sociales"
                        }
                    },
                    {
                        "id": "http://data.education.fr/voc/scolomfr/concept/scolomfr-voc-015-num-6354",
                        "entry": {
                            "string": "sciences numériques et technologie (enseignement commun)"
                        }
                    },
                    {
                        "id": "http://data.education.fr/voc/scolomfr/concept/scolomfr-voc-015-num-6382",
                        "entry": {
                            "string": "théâtre (enseignement de spécialité)"
                        }
                    },
                    {
                        "id": "http://data.education.fr/voc/scolomfr/concept/scolomfr-voc-015-num-004",
                        "entry": {
                            "string": "théâtre (enseignement optionnel)"
                        }
                    }
                ]
            }
        },
        {
            "purpose": {
                "source": "SCOLOMFRv2.1",
                "value": " http://data.education.fr/voc/scolomfr/concept/educational_level",
                "label": "niveau éducatif détaillé "
            },
            "taxonPath": {
                "source": {
                    "string": "SCOLOMFRv3.0 ; scolomfr-voc-021 ; Niveau éducatif détaillé"
                },
                "taxon": [
                    {
                        "id": " http://data.education.fr/voc/scolomfr/concept/scolomfr-voc-022-num-004",
                        "entry": {
                            "string": "toute petite section "
                        }
                    },
                    {
                        "id": " http://data.education.fr/voc/scolomfr/concept/scolomfr-voc-022-num-005",
                        "entry": {
                            "string": "petite section "
                        }
                    },
                    {
                        "id": " http://data.education.fr/voc/scolomfr/concept/scolomfr-voc-022-num-006",
                        "entry": {
                            "string": "moyenne section "
                        }
                    },
                    {
                        "id": " http://data.education.fr/voc/scolomfr/concept/scolomfr-voc-022-num-007",
                        "entry": {
                            "string": "grande section "
                        }
                    },
                    {
                        "id": " http://data.education.fr/voc/scolomfr/concept/scolomfr-voc-022-num-010",
                        "entry": {
                            "string": "CP "
                        }
                    },
                    {
                        "id": " http://data.education.fr/voc/scolomfr/concept/scolomfr-voc-022-num-011",
                        "entry": {
                            "string": "CE1 "
                        }
                    },
                    {
                        "id": " http://data.education.fr/voc/scolomfr/concept/scolomfr-voc-022-num-013",
                        "entry": {
                            "string": "CE2 "
                        }
                    },
                    {
                        "id": " http://data.education.fr/voc/scolomfr/concept/scolomfr-voc-022-num-014",
                        "entry": {
                            "string": "CM1 "
                        }
                    },
                    {
                        "id": " http://data.education.fr/voc/scolomfr/concept/scolomfr-voc-022-num-015",
                        "entry": {
                            "string": "CM2 "
                        }
                    },
                    {
                        "id": " http://data.education.fr/voc/scolomfr/concept/scolomfr-voc-022-num-018",
                        "entry": {
                            "string": "6e "
                        }
                    },
                    {
                        "id": " http://data.education.fr/voc/scolomfr/concept/scolomfr-voc-022-num-020",
                        "entry": {
                            "string": "5e "
                        }
                    },
                    {
                        "id": " http://data.education.fr/voc/scolomfr/concept/scolomfr-voc-022-num-021",
                        "entry": {
                            "string": "4e "
                        }
                    },
                    {
                        "id": " http://data.education.fr/voc/scolomfr/concept/scolomfr-voc-022-num-023",
                        "entry": {
                            "string": "3e "
                        }
                    },
                    {
                        "id": " http://data.education.fr/voc/scolomfr/concept/scolomfr-voc-022-num-136",
                        "entry": {
                            "string": "2de générale et technologique "
                        }
                    },
                    {
                        "id": " http://data.education.fr/voc/scolomfr/concept/scolomfr-voc-022-num-123",
                        "entry": {
                            "string": "1re générale et technologique "
                        }
                    },
                    {
                        "id": " http://data.education.fr/voc/scolomfr/concept/scolomfr-voc-022-num-088",
                        "entry": {
                            "string": "terminale générale et technologique "
                        }
                    },
                    {
                        "id": " http://data.education.fr/voc/scolomfr/concept/scolomfr-voc-022-num-027",
                        "entry": {
                            "string": "2de professionnelle "
                        }
                    },
                    {
                        "id": " http://data.education.fr/voc/scolomfr/concept/scolomfr-voc-022-num-127",
                        "entry": {
                            "string": "1re professionnelle "
                        }
                    },
                    {
                        "id": " http://data.education.fr/voc/scolomfr/concept/scolomfr-voc-022-num-050",
                        "entry": {
                            "string": "terminale professionnelle "
                        }
                    }
                ]
            }
        },
        {
            "purpose": {
                "source": "SCOLOMFRv2.1",
                "value": " http://data.education.fr/voc/scolomfr/concept/scolomfr-voc-028-num-014",
                "label": "type de distribution "
            },
            "taxonPath": {
                "source": {
                    "string": "SCOLOMFRv3.0 ; scolomfr-voc-046 ; Type de distribution"
                },
                "taxon": {
                    "id": " http://data.education.fr/voc/scolomfr/concept/scolomfr-voc-046-num-001",
                    "entry": {
                        "string": "en ligne "
                    }
                }
            }
        },
        {
            "purpose": {
                "source": "SCOLOMFRv2.1",
                "value": "http://data.education.fr/voc/scolomfr/concept/scolomfr-voc-028-num-013",
                "label": "label"
            },
            "taxonPath": {
                "source": {
                    "string": "SCOLOMFRv2.1 ; scolomfr-voc-043 ; Label"
                },
                "taxon": {
                    "id": "http://data.education.fr/voc/scolomfr/concept/scolomfr-voc-045-num-001",
                    "entry": {
                        "string": "FARE"
                    }
                }
            },
            "description": {
                "string": "GAR_Présentation : [DOC] ressources documentaires et de presse"
            }
        }
    ]
}