{
	"id": "bc294207-cab9-4e19-9c6e-29a55d706075",
	"name": "compte-ressource (local)",
	"values": [
		{
			"key": "KEYCLOAK_USERNAME",
			"value": "manuel@educ.gouv.fr",
			"type": "default",
			"enabled": true
		},
		{
			"key": "KEYCLOAK_PASSWORD",
			"value": "test",
			"type": "secret",
			"enabled": true
		},
		{
			"key": "KEYCLOAK_CLIENT_ID",
			"value": "compte-ressource-app",
			"type": "default",
			"enabled": true
		},
		{
			"key": "KEYCLOAK_REALM",
			"value": "education-nationale",
			"type": "default",
			"enabled": true
		},
		{
			"key": "KEYCLOAK_HOST",
			"value": "http://localhost:8080",
			"type": "default",
			"enabled": true
		}
	],
	"_postman_variable_scope": "environment",
	"_postman_exported_at": "2024-06-14T07:44:52.409Z",
	"_postman_exported_using": "Postman/11.1.25"
}