alpine-baselayout-3.2.0-r7
alpine-keys-2.2-r0
apk-tools-2.10.5-r1
bash-5.0.17-r0
busybox-1.31.1-r19
ca-certificates-20191127-r4
ca-certificates-bundle-20191127-r4
coreutils-8.32-r0
curl-7.69.1-r0
gmp-6.2.0-r0
hiredis-0.14.1-r0
leveldb-1.22-r1
libacl-2.2.53-r0
libattr-2.4.48-r0
libc-utils-0.7.2-r3
libcrypto1.1-1.1.1g-r0
libcurl-7.69.1-r0
libgcc-9.3.0-r2
libintl-0.20.2-r0
libproc-3.3.16-r0
libssl1.1-1.1.1g-r0
libstdc++-9.3.0-r2
libtls-standalone-2.9.1-r1
linux-pam-1.3.1-r4
lua-socket-3.0_rc1_git20160306-r2
luajit-5.1.20190925-r0
musl-1.1.24-r9
musl-utils-1.1.24-r9
ncurses-libs-6.2_p20200523-r0
ncurses-terminfo-base-6.2_p20200523-r0
nghttp2-libs-1.41.0-r0
procps-3.3.16-r0
readline-8.0.4-r0
scanelf-1.2.6-r0
shadow-4.8.1-r0
snappy-1.1.8-r2
sqlite-3.32.1-r0
sqlite-libs-3.32.1-r0
ssl_client-1.31.1-r19
tzdata-2020a-r0
xz-5.2.5-r0
xz-libs-5.2.5-r0
zlib-1.2.11-r3
