<svg width="300" height="200" viewBox="0 0 300 200" fill="none" xmlns="http://www.w3.org/2000/svg">
<path fill-rule="evenodd" clip-rule="evenodd" d="M226.349 32.2481C227.625 27.4363 224.75 22.4955 219.93 21.2196L160.719 5.55722C155.899 4.28267 150.949 7.15345 149.673 11.9652L128.71 90.9492C127.434 95.761 130.309 100.703 135.129 101.978L194.339 117.64C199.159 118.915 204.11 116.044 205.386 111.232L226.349 32.2481Z" fill="var(--colors-category-accessories-high1)"/>
<path fill-rule="evenodd" clip-rule="evenodd" d="M219.197 34.2338C219.457 33.2525 218.871 32.2453 217.888 31.9847L157.156 15.9205C156.174 15.6599 155.165 16.2449 154.904 17.2263L151.13 31.4458C150.87 32.4258 151.456 33.4343 152.439 33.6936L213.171 49.7592C214.153 50.0184 215.162 49.4334 215.423 48.452L219.197 34.2338Z" fill="var(--colors-category-accessories-low2)"/>
<path fill-rule="evenodd" clip-rule="evenodd" d="M161.976 48.2661C162.499 46.2952 161.32 44.2714 159.348 43.7488L152.193 41.8567C150.219 41.3341 148.192 42.5109 147.67 44.4805L145.775 51.6228C145.251 53.5937 146.429 55.6175 148.403 56.1387L155.556 58.0308C157.53 58.5534 159.557 57.378 160.08 55.4071L161.976 48.2661Z" fill="var(--colors-category-accessories-low1)"/>
<path fill-rule="evenodd" clip-rule="evenodd" d="M157.472 65.2357C157.995 63.2648 156.818 61.241 154.844 60.7198L147.691 58.8276C145.717 58.305 143.689 59.4805 143.166 61.4514L141.271 68.5924C140.747 70.5632 141.926 72.587 143.9 73.1096L151.053 75.0018C153.027 75.5243 155.054 74.3475 155.576 72.3767L157.472 65.2357Z" fill="var(--colors-category-accessories-low1)"/>
<path fill-rule="evenodd" clip-rule="evenodd" d="M153.035 81.9527C153.559 79.9832 152.38 77.9594 150.406 77.4368L143.253 75.5447C141.279 75.0221 139.252 76.1989 138.73 78.1684L136.834 85.3108C136.311 87.2803 137.488 89.3055 139.462 89.8267L146.615 91.7188C148.589 92.2414 150.617 91.0659 151.14 89.0951L153.035 81.9527Z" fill="var(--colors-category-accessories-low1)"/>
<path fill-rule="evenodd" clip-rule="evenodd" d="M178.638 52.6734C179.161 50.7026 177.982 48.6788 176.01 48.1562L168.855 46.264C166.883 45.7415 164.855 46.9183 164.332 48.8892L162.437 56.0302C161.913 58.001 163.092 60.0248 165.065 60.546L172.219 62.4382C174.192 62.9608 176.219 61.7853 176.742 59.8144L178.638 52.6734Z" fill="var(--colors-category-accessories-low1)"/>
<path fill-rule="evenodd" clip-rule="evenodd" d="M174.133 69.6429C174.656 67.6734 173.479 65.6482 171.505 65.127L164.352 63.2348C162.378 62.7123 160.351 63.8877 159.827 65.8586L157.932 73.001C157.408 74.9705 158.587 76.9943 160.561 77.5168L167.714 79.409C169.688 79.9316 171.715 78.7547 172.238 76.7852L174.133 69.6429Z" fill="var(--colors-category-accessories-low1)"/>
<path fill-rule="evenodd" clip-rule="evenodd" d="M169.696 86.3614C170.22 84.3906 169.041 82.3668 167.067 81.8442L159.914 79.952C157.94 79.4295 155.913 80.6063 155.391 82.5772L153.495 89.7181C152.972 91.689 154.149 93.7128 156.124 94.234L163.276 96.1262C165.251 96.6488 167.278 95.4733 167.801 93.5024L169.696 86.3614Z" fill="var(--colors-category-accessories-low1)"/>
<path fill-rule="evenodd" clip-rule="evenodd" d="M195.3 57.0808C195.823 55.1099 194.646 53.0861 192.672 52.5635L185.519 50.6714C183.545 50.1488 181.518 51.3256 180.994 53.2965L179.099 60.4375C178.575 62.4084 179.754 64.4322 181.727 64.9548L188.881 66.8469C190.855 67.3681 192.882 66.1927 193.405 64.2218L195.3 57.0808Z" fill="var(--colors-category-accessories-low1)"/>
<path fill-rule="evenodd" clip-rule="evenodd" d="M190.796 74.0516C191.318 72.0807 190.141 70.0569 188.167 69.5344L181.014 67.6422C179.04 67.1196 177.013 68.2965 176.489 70.2673L174.594 77.4083C174.071 79.3792 175.249 81.403 177.223 81.9242L184.376 83.8164C186.35 84.3389 188.378 83.1635 188.9 81.1926L190.796 74.0516Z" fill="var(--colors-category-accessories-low1)"/>
<path fill-rule="evenodd" clip-rule="evenodd" d="M186.36 90.7687C186.883 88.7978 185.704 86.774 183.731 86.2514L176.577 84.3593C174.604 83.8367 172.576 85.0135 172.054 86.9844L170.159 94.1254C169.635 96.0962 170.812 98.12 172.787 98.6426L179.941 100.535C181.914 101.056 183.941 99.8805 184.464 97.9097L186.36 90.7687Z" fill="var(--colors-category-accessories-low1)"/>
<path fill-rule="evenodd" clip-rule="evenodd" d="M211.962 61.4879C212.485 59.5171 211.308 57.4932 209.334 56.9707L202.181 55.0785C200.207 54.5573 198.18 55.7328 197.656 57.7036L195.761 64.8446C195.238 66.8155 196.416 68.8393 198.39 69.3619L205.543 71.254C207.517 71.7752 209.545 70.5998 210.067 68.6289L211.962 61.4879Z" fill="var(--colors-category-accessories-low1)"/>
<path fill-rule="evenodd" clip-rule="evenodd" d="M207.459 78.459C207.981 76.4881 206.804 74.4643 204.83 73.9417L197.677 72.0496C195.703 71.527 193.676 72.7038 193.152 74.6747L186.821 98.5328C186.297 100.504 187.476 102.527 189.449 103.05L196.603 104.942C198.576 105.463 200.604 104.288 201.126 102.317L207.459 78.459Z" fill="var(--colors-category-accessories-low1)"/>
<path fill-rule="evenodd" clip-rule="evenodd" d="M191.056 95.3199C213.572 87.2613 238.405 98.9671 246.479 121.446C254.551 143.925 242.824 168.717 220.309 176.776C197.793 184.836 172.96 173.128 164.886 150.651C156.814 128.172 168.541 103.378 191.056 95.3199Z" fill="var(--colors-category-accessories-high1)"/>
<path fill-rule="evenodd" clip-rule="evenodd" d="M245.837 121.677C237.892 99.5526 213.449 88.03 191.286 95.9621C169.126 103.894 157.585 128.297 165.529 150.42L164.887 150.651L165.529 150.42C173.475 172.543 197.917 184.067 220.08 176.133L220.31 176.776L220.08 176.133C242.241 168.202 253.782 143.8 245.837 121.677ZM247.121 121.216L246.495 121.44L247.121 121.216C255.321 144.05 243.409 169.232 220.54 177.418C197.67 185.604 172.446 173.714 164.245 150.881L164.245 150.881C156.045 128.047 167.958 102.863 190.827 94.6777L191.035 95.2582L190.827 94.6777C213.697 86.4926 238.92 98.3815 247.121 121.216Z" fill="var(--colors-category-accessories-low1)"/>
<path fill-rule="evenodd" clip-rule="evenodd" d="M217.612 177.644C204.857 169.527 194.6 157.285 189.104 141.983C183.609 126.68 183.737 110.719 188.422 96.3596" fill="var(--colors-category-accessories-high1)"/>
<path fill-rule="evenodd" clip-rule="evenodd" d="M188.634 95.7112C188.992 95.828 189.187 96.2131 189.071 96.5712C184.431 110.792 184.304 126.597 189.747 141.752C195.189 156.907 205.346 169.03 217.979 177.069C218.297 177.271 218.39 177.693 218.188 178.01C217.986 178.328 217.564 178.422 217.247 178.22C204.368 170.025 194.011 157.664 188.463 142.213C182.914 126.763 183.043 110.646 187.774 96.1481C187.891 95.7899 188.276 95.5943 188.634 95.7112Z" fill="var(--colors-category-accessories-low1)"/>
<path fill-rule="evenodd" clip-rule="evenodd" d="M193.755 94.4512C206.511 102.568 216.767 114.811 222.263 130.114C227.759 145.417 227.631 161.376 222.946 175.736" fill="var(--colors-category-accessories-high1)"/>
<path fill-rule="evenodd" clip-rule="evenodd" d="M193.179 94.085C193.381 93.7672 193.803 93.6735 194.121 93.8758C206.999 102.071 217.356 114.433 222.904 129.884C228.453 145.334 228.324 161.449 223.593 175.947C223.477 176.306 223.092 176.501 222.733 176.384C222.375 176.267 222.18 175.882 222.297 175.524C226.937 161.304 227.063 145.5 221.621 130.345C216.178 115.19 206.021 103.065 193.388 95.0266C193.07 94.8244 192.977 94.4028 193.179 94.085Z" fill="var(--colors-category-accessories-low1)"/>
<path fill-rule="evenodd" clip-rule="evenodd" d="M239.173 108.915C239.3 109.269 239.115 109.66 238.76 109.787L163.428 136.75C163.073 136.877 162.683 136.693 162.556 136.338C162.429 135.983 162.613 135.593 162.968 135.466L238.301 108.502C238.655 108.375 239.046 108.56 239.173 108.915Z" fill="var(--colors-category-accessories-low1)"/>
<path fill-rule="evenodd" clip-rule="evenodd" d="M248.812 135.757C248.939 136.112 248.755 136.503 248.4 136.629L173.067 163.595C172.713 163.721 172.322 163.537 172.195 163.182C172.068 162.828 172.253 162.437 172.608 162.31L247.94 135.345C248.295 135.218 248.686 135.403 248.812 135.757Z" fill="var(--colors-category-accessories-low1)"/>
<path fill-rule="evenodd" clip-rule="evenodd" d="M258 155.795L251.938 166.815L243.299 162.08L237.67 172.314L214.691 139.222L254.991 140.825L249.363 151.059L258 155.795Z" fill="var(--colors-category-accessories-low2)"/>
<path fill-rule="evenodd" clip-rule="evenodd" d="M98.4678 143.639L88.2559 147.644C88.2559 147.644 90.4407 153.197 91.8058 156.667C91.9988 157.157 92.4584 157.489 92.9859 157.52C93.5121 157.55 94.0083 157.272 94.2558 156.808C94.7629 155.86 95.3068 154.842 95.6956 154.116C96.0056 153.537 96.6895 153.264 97.3135 153.47C98.1293 153.74 99.2863 154.124 100.351 154.476C100.848 154.641 101.396 154.503 101.757 154.123C102.118 153.743 102.226 153.189 102.034 152.702C100.67 149.236 98.4678 143.639 98.4678 143.639Z" fill="var(--colors-category-accessories-high1)"/>
<path fill-rule="evenodd" clip-rule="evenodd" d="M42.5771 66.342C42.4589 66.0393 42.4194 65.7122 42.4643 65.3919C42.55 64.7648 42.7022 63.6612 42.8178 62.8292C42.9116 62.1519 43.3644 61.5764 44.002 61.3266C52.0209 58.1816 104.277 37.6884 115.1 33.444C116.183 33.0205 117.406 33.5526 117.83 34.633C122.439 46.3442 146.304 106.997 150.447 117.529C150.61 117.943 150.602 118.404 150.423 118.812C150.245 119.219 149.912 119.539 149.499 119.702C148.691 120.018 147.871 120.34 147.871 120.34C147.871 120.34 148.244 121.286 148.596 122.181C148.935 123.041 148.51 124.014 147.647 124.352C137.073 128.499 76.3972 152.295 76.3972 152.295C76.3972 152.295 45.242 73.1138 42.5771 66.342Z" fill="var(--colors-category-accessories-low2)"/>
<path fill-rule="evenodd" clip-rule="evenodd" d="M44.8859 64.4212C44.8044 64.4525 44.7133 64.4403 44.6439 64.3873C44.5746 64.3344 44.5379 64.2489 44.5488 64.162C44.6018 63.6815 44.6902 62.9092 44.7255 62.5861C44.7364 62.4952 44.7962 62.4164 44.8819 62.3839C48.0593 61.1378 104.597 38.9656 114.627 35.032C115.463 34.7049 116.408 35.1148 116.737 35.9509C120.933 46.6156 145.994 110.309 148.957 117.84C149.14 118.305 149.131 118.825 148.931 119.284C148.614 120.01 148.169 121.028 148.169 121.028C148.169 121.028 120.124 49.7497 115.663 38.4104C115.505 38.01 115.194 37.687 114.798 37.5159C114.402 37.3435 113.954 37.3354 113.553 37.4929C103.788 41.3219 49.9613 62.43 44.8859 64.4212Z" fill="var(--colors-category-accessories-high2)"/>
<path d="M64.6243 80.7644L64.9735 84.8104L62.3624 85.8336L61.1772 68.0608L64.0991 66.9157L75.314 80.758L72.703 81.7813L70.1986 78.5798L64.6243 80.7644ZM63.5936 70.006C63.7013 70.7047 63.7882 71.4116 63.8545 72.1266C63.9207 72.8416 64.0077 73.5485 64.0576 74.2221L64.4194 78.2393L68.6468 76.5826L66.1839 73.365C65.7283 72.7547 65.2809 72.1652 64.8254 71.5549C64.3698 70.9447 63.9757 70.4299 63.6557 69.9816L63.5936 70.006Z" fill="var(--colors-category-accessories-high2)"/>
<path d="M72.153 92.4293C73.7899 91.7878 75.1925 91.6444 76.3111 91.9948C77.4379 92.3658 78.2806 93.2306 78.8106 94.5765C79.1693 95.4875 79.2763 96.306 79.119 97.0608C78.9617 97.8155 78.5446 98.457 77.8883 98.9771L77.9046 99.0185C78.8075 98.7603 79.6588 98.8569 80.4584 99.3084C81.2454 99.7886 81.8491 100.532 82.2567 101.567C82.8192 102.996 82.754 104.288 82.061 105.444C81.3681 106.6 80.0932 107.554 78.2283 108.285L73.3795 110.185L67.1592 94.3864L72.153 92.4293ZM72.2671 100.009L74.5671 99.1075C75.4581 98.7584 76.0686 98.304 76.3984 97.7445C76.7283 97.1851 76.7361 96.5367 76.4507 95.812C76.1654 95.0873 75.7173 94.6175 75.1066 94.4028C74.504 94.2087 73.7675 94.2822 72.918 94.6152L70.5143 95.5572L72.2671 100.009ZM75.0389 107.049L77.3804 106.131C78.4165 105.725 79.1349 105.181 79.5439 104.519C79.9322 103.865 79.994 103.171 79.6924 102.405C79.3907 101.639 78.8642 101.152 78.1335 100.936C77.4029 100.721 76.5339 100.822 75.5186 101.22L73.1149 102.162L75.0389 107.049Z" fill="var(--colors-category-accessories-high2)"/>
<path d="M81.7157 126.457C82.425 128.258 83.402 129.524 84.6259 130.264C85.8498 131.003 87.1311 131.098 88.4987 130.562C89.141 130.311 89.7966 129.91 90.4322 129.398C91.0678 128.886 91.559 128.311 91.9635 127.699L92.9174 130.121C92.5172 130.684 91.9601 131.213 91.275 131.721C90.598 132.249 89.872 132.653 89.1054 132.954C87.0954 133.741 85.1775 133.609 83.3598 132.576C81.5421 131.544 80.1542 129.841 79.2166 127.46C78.2791 125.079 78.147 122.86 78.8158 120.853C79.4847 118.846 80.8407 117.43 82.8921 116.626C83.6381 116.334 84.4248 116.145 85.2234 116.047C86.022 115.95 86.7289 115.983 87.2945 116.144L88.2484 118.567C87.5133 118.401 86.7693 118.334 86.0373 118.358C85.3134 118.402 84.6303 118.55 84.0087 118.794C82.5996 119.346 81.6845 120.302 81.2633 121.663C80.8502 123.043 80.9983 124.634 81.7157 126.457Z" fill="var(--colors-category-accessories-high2)"/>
</svg>
