<svg width="149" height="95" viewBox="0 0 149 95" fill="none" xmlns="http://www.w3.org/2000/svg">
  <path d="M42.4512 33.4773C42.0591 29.7465 44.7579 26.4051 48.4791 26.014L68.6928 23.8894C72.4141 23.4983 75.7486 26.2056 76.1407 29.9363L78.2707 50.2016C78.6628 53.9323 75.964 57.2738 72.2428 57.6649L52.0291 59.7894C48.3078 60.1806 44.9733 57.4733 44.5812 53.7425L42.4512 33.4773Z" fill="var(--colors-category-all-low)"/>
  <path d="M86.2476 28.8741C85.8554 25.1433 88.5542 21.8019 92.2755 21.4108L112.489 19.2863C116.21 18.8951 119.545 21.6024 119.937 25.3332L122.067 45.5984C122.459 49.3292 119.76 52.6706 116.039 53.0617L95.8254 55.1863C92.1042 55.5774 88.7696 52.8701 88.3775 49.1393L86.2476 28.8741Z" fill="var(--colors-category-all-low)"/>
  <path d="M47.0661 77.3853C46.674 73.6546 49.3728 70.3132 53.094 69.9221L73.3077 67.7975C77.029 67.4064 80.3635 70.1137 80.7556 73.8444L82.8856 94.1097C83.2777 97.8404 80.5789 101.182 76.8577 101.573L56.644 103.698C52.9227 104.089 49.5882 101.381 49.1961 97.6506L47.0661 77.3853Z" fill="var(--colors-category-all-low)"/>
  <path d="M90.8625 72.7822C90.4704 69.0514 93.1692 65.71 96.8904 65.3189L117.104 63.1943C120.825 62.8032 124.16 65.5105 124.552 69.2412L126.682 89.5065C127.074 93.2372 124.375 96.5787 120.654 96.9698L100.44 99.0943C96.7191 99.4854 93.3846 96.7782 92.9925 93.0474L90.8625 72.7822Z" fill="var(--colors-category-all-low)"/>
</svg>