<svg width="200" height="200" fill="none" xmlns="http://www.w3.org/2000/svg">
  <g clip-path="url(#a)">
    <path fill-rule="evenodd" clip-rule="evenodd" d="M66.737 136.388S47.5 202.254 46.405 222.895c-1.094 20.648 2.424 46.935 54.44 45.627 49.019-1.228 56.346-14.387 51.576-57.32-4.36-39.236-15.115-77.195-15.115-77.195l-70.569 2.381Z" fill="#62B9BF"/>
    <mask id="b" style="mask-type:luminance" maskUnits="userSpaceOnUse" x="46" y="134" width="108" height="135">
      <path d="M66.737 136.388S47.5 202.254 46.405 222.895c-1.094 20.648 2.424 46.935 54.44 45.627 49.019-1.228 56.346-14.387 51.576-57.32-4.36-39.236-15.115-77.195-15.115-77.195l-70.569 2.381Z" fill="#fff"/>
    </mask>
    <g mask="url(#b)">
      <path fill-rule="evenodd" clip-rule="evenodd" d="M101.483 162.587c20.093 1.034 34.673 8.976 38.774 52.255 2.854 30.126-5.616 35.95-10.211 42.47-9.17 13.017-50.36 10.173-57.244 3.696-5.29-4.979-15.471-17.348-9.808-47.281 5.665-29.935 6.015-52.811 38.489-51.14Z" fill="#ECF7F7"/>
    </g>
    <path fill-rule="evenodd" clip-rule="evenodd" d="m66.737 136.388 70.569-2.381s10.755 37.959 15.115 77.195c4.77 42.933-2.557 56.092-51.576 57.32-52.016 1.308-55.534-24.979-54.44-45.627 1.094-20.641 20.332-86.507 20.332-86.507Zm1.385 1.805c-2.674 9.247-18.89 65.958-19.888 84.807-.524 9.889-.048 21.16 6.895 29.772 7.01 8.699 20.506 14.534 45.67 13.899 12.071-.302 21.578-1.326 28.971-3.368 7.079-1.962 12.162-4.843 15.634-8.995 3.468-4.152 5.306-9.543 6.043-16.41.77-7.181.328-15.922-.847-26.49-3.853-34.676-12.721-68.352-14.671-75.503l-67.807 2.288Z" fill="#62B9BF"/>
    <path fill-rule="evenodd" clip-rule="evenodd" d="M106.04 185.803c1.189-1.401 2.141-5.58-3.89-8.312-5.586-2.53-6.775-1.386-11.367-4.802a.414.414 0 0 0-.477.049.425.425 0 0 0-.113.471c1.967 4.972 9.02 20.637 15.847 12.594Z" fill="#713426"/>
    <path fill-rule="evenodd" clip-rule="evenodd" d="M107.007 183.612c-1.327 1.432-2.616 2.988-3.523 5.006 4.827 8.08 24.152 21.405 57.345 41.322a3.055 3.055 0 0 0 3.172-.012c.083-.056.168-.111.25-.167a3.134 3.134 0 0 0 1.354-2.436 3.127 3.127 0 0 0-1.119-2.554c-28.04-23.367-55.227-43.691-57.479-41.159Z" fill="#A84D39"/>
    <path fill-rule="evenodd" clip-rule="evenodd" d="M107.516 193.517c1.478-2.979 3.368-5.541 5.654-7.725 0 0-5.065-3.017-6.765-3.105-1.004-.053-4.152 4.107-3.784 4.857.597 1.218.606 1.984 4.895 5.973Z" fill="#DB9889"/>
    <path fill-rule="evenodd" clip-rule="evenodd" d="M137.186 138.128c3.962 4.734 21.088 20.992 27.683 47.836 1.494 6.078-4.991 20.23-22.459 35.932-10.731 9.648-26.763-3.531-25.824-17.952.94-14.422 17.958-20.079 27.799-28.311 0 0-10.419-25.488-13.493-30.327-3.074-4.838 2.332-11.912 6.294-7.178ZM68.031 38.186C83.492 48.4 87.508 69.879 76.994 86.12c-10.514 16.242-31.6 21.137-47.06 10.923-7.896-5.216-13.3-15.47-14.332-24.827-.647-5.883-1.233.604-1.583-2.619-.202-1.857 1.242-5.982 2.2-8.63.584-1.61-1.717.152.226-3.72 1.176-2.344 3.35-6.323 4.526-8.14 3.696-5.71 8.526-10.413 14.305-12.759 14.038-5.697 26.49-2.303 32.755 1.837Z" fill="#62B9BF"/>
    <path fill-rule="evenodd" clip-rule="evenodd" d="M60.868 52.318c8.848 5.846 11.146 18.138 5.129 27.434-6.017 9.296-18.085 12.097-26.933 6.252-8.848-5.846-11.147-18.139-5.13-27.434 6.017-9.297 18.086-12.097 26.934-6.252Z" fill="#ECF7F7"/>
    <path fill-rule="evenodd" clip-rule="evenodd" d="M172.362 47.362c2.216 2.558 4.45 6.707 5.536 8.734.627 1.169 1.502 4.108 1.885 9.19.765 10.156-.103 23.084-9.134 30.177-13.049 10.25-33.462 5.814-45.555-9.9-12.093-15.714-11.317-36.793 1.733-47.043 10.469-8.223 25.677-6.994 37.526 1.927 1.569 1.181 4.23 2.554 8.009 6.915Z" fill="#62B9BF"/>
    <path fill-rule="evenodd" clip-rule="evenodd" d="M162.74 54.385c7.3 9.485 5.657 23.132-3.667 30.456-9.324 7.323-22.821 5.569-30.12-3.917-7.3-9.485-5.656-23.132 3.668-30.456 9.324-7.324 22.82-5.568 30.119 3.917Z" fill="#ECF7F7"/>
    <path fill-rule="evenodd" clip-rule="evenodd" d="M102.468 49.833c1.041.04-.647-3.07.359-2.992 1.276.1 5.638 2.36 6.775 2.835 1.729.723 2.902 1.208 4.441 1.53 13.491 2.819 23.389 9.755 31.12 20.564 4.65 6.502 9.571 20.98 10.357 42.569.233 6.413-1.109 12.098-3.729 17.017-.636 1.194-.984 3.794-1.522 6.454-.791 3.9-1.768-.506-2.39.227-.788.93-.985 3.919-1.88 4.775-1.444 1.381-.173-3.287-5.35.789-9.351 7.365-23.514 10.328-38.81 10.251-16.975-.086-34.234-9.149-44.91-15.083-3.06-1.7-9.038-7.175-9.791-12.939-.23-1.759-1.598 2.29-2.689-1.679-.658-2.394.77-4.634-1.36-2.575-.435.42-1.23.625-.96-1.12.373-2.394 1.945-7.229 1.827-8.969-.23-3.424.073-6.941.98-10.506 2.437-9.593 6.411-22.296 12.192-29.957 9.414-12.475 20.15-19.726 36.507-21.04 1.639-.13.236-2.694 1.991-2.705 1.219-.009 5.564 2.503 6.842 2.553Z" fill="#62B9BF"/>
    <path fill-rule="evenodd" clip-rule="evenodd" d="M105.703 93.148c4.515.658 8.815 17.675 5.766 22.864-3.049 5.188-14.058 3.845-18.703-.499-3.229-3.019 3.01-23.812 12.937-22.365Z" fill="#2D797E"/>
    <path fill-rule="evenodd" clip-rule="evenodd" d="M90.083 125.37a1.549 1.549 0 0 1 .815-2.02 1.522 1.522 0 0 1 1.999.824c.724 1.74 2.617 3.466 4.941 4.516 3.521 1.591 8.112 1.561 11.527-2.665a1.517 1.517 0 0 1 2.148-.22c.653.539.75 1.511.217 2.17-4.486 5.553-10.513 5.621-15.138 3.531-3.106-1.403-5.542-3.811-6.51-6.136ZM78.102 90.672c.463-.17.978-.208 1.496-.12.225-.04.467-.06.728-.062.721-.002 1.459.205 2.032.676.809.663 1.138 1.425 1.173 2.16.022.46-.08.922-.28 1.355.023.216.023.429-.003.64-.24 1.965-1.916 2.77-3.727 2.598-1.668-.16-3.34-1.204-3.79-2.606-.467-1.447-.254-2.532.25-3.293.473-.712 1.246-1.166 2.12-1.348Zm44.688 2.492a2.915 2.915 0 0 1 1.035-1.204c.391-.256.901-.374 1.468-.338.296-.05.6-.037.906.025.753.152 1.523.652 2.064 1.086 1.317 1.059 1.965 2.518 1.727 3.808a3.084 3.084 0 0 1-.862 1.624c-.405.695-1.089 1.25-2.142 1.47-.765.162-1.505.005-2.157-.37-1.184-.437-2.15-1.777-2.45-3.228-.215-1.04-.093-2.086.411-2.873Z" fill="#1D4C50"/>
    <path fill-rule="evenodd" clip-rule="evenodd" d="M59.843 138.051c-4.736 7.541-22.143 41.887-27.174 69.529-1.148 6.307-1.295 17.153-1.343 25.914-.065 11.585 11.053 12.763 19.184 13.3 9.834.654 12.628-25.016 12.255-30.087-1.726-23.433 11.51-76.349 13.438-76.51 0 0-11.624-9.687-16.36-2.146Z" fill="#62B9BF"/>
    <path fill-rule="evenodd" clip-rule="evenodd" d="M66.752 156.959c.3-.61 1.033-.86 1.637-.558.604.303.851 1.044.552 1.654-6.616 13.487-7.969 33.608-7.866 40.901.207 14.816 1.506 27.141 1.651 31.101a1.228 1.228 0 0 1-1.174 1.277 1.227 1.227 0 0 1-1.266-1.19c-.146-3.961-1.446-16.31-1.654-31.152-.105-7.497 1.32-28.171 8.12-42.033Z" fill="#369196"/>
    <path fill-rule="evenodd" clip-rule="evenodd" d="M52.991 202.254c9.252-3.741 50.246 20.481 25.658 53.775-10.114 13.689-37.033 17.977-52.352 2.672-15.318-15.306-12.433-31.882-6.856-44.67 1.95-4.471 4.71-6.896 8.202-8.449a3.385 3.385 0 0 1 2.743.009 3.437 3.437 0 0 1 1.851 2.046c.644 1.893 2.316 4.793 5.648 9.347 6.346 8.675 12.373 5.189 14.406 1.763 5.047-8.509-8.36-12.829.7-16.493Z" fill="#FBE5AC"/>
    <path fill-rule="evenodd" clip-rule="evenodd" d="M130.385 187.167a1.212 1.212 0 0 1-1.692-.346 1.242 1.242 0 0 1 .342-1.71c3.972-2.661 7.077-4.458 9.336-6.059 1.993-1.412 3.292-2.604 3.812-4.258.419-1.333.328-2.932-.18-5.104-.851-3.635-2.862-8.701-5.98-16.347a1.238 1.238 0 0 1 .665-1.61c.623-.26 1.337.04 1.594.67 3.188 7.817 5.228 13.003 6.098 16.72.639 2.73.658 4.742.131 6.418-.541 1.721-1.656 3.119-3.419 4.54-2.332 1.881-5.887 3.857-10.707 7.086Zm-70.01-44.371a1.24 1.24 0 0 1-.662-1.612 1.218 1.218 0 0 1 1.596-.669c6.468 2.703 10.967 5.345 18.306 6.621.664.116 1.11.754.996 1.426a1.224 1.224 0 0 1-1.41 1.006c-7.543-1.312-12.178-3.995-18.826-6.772Zm78.871.183a1.218 1.218 0 0 1 1.538.792 1.238 1.238 0 0 1-.785 1.555c-2.173.712-5.068 2.938-7.997 4.541-2.216 1.212-4.457 2.072-6.455 1.97a1.23 1.23 0 0 1-1.159-1.294 1.227 1.227 0 0 1 1.281-1.17c2.05.103 4.368-1.158 6.621-2.513 2.564-1.543 5.035-3.252 6.956-3.881Z" fill="#369196"/>
  </g>
  <defs>
    <clipPath id="a">
      <path d="M0 0h200v200H0V0Z" fill="#fff"/>
    </clipPath>
  </defs>
</svg>
