<?xml version="1.0" encoding="utf-8"?>
<!-- Generator: Adobe Illustrator 23.0.3, SVG Export Plug-In . SVG Version: 6.00 Build 0)  -->
<svg version="1.1" id="Calque_1" xmlns="http://www.w3.org/2000/svg" xmlns:xlink="http://www.w3.org/1999/xlink" x="0px" y="0px"
	 viewBox="0 0 800 800" style="enable-background:new 0 0 800 800;" xml:space="preserve">
<style type="text/css">
	.st0{fill:#195DA9;stroke:#0070D6;stroke-miterlimit:10;}
	.st1{fill:#FFFFFF;stroke:#FFFFFF;stroke-miterlimit:10;}
	.st2{fill:#FFFFFF;}
</style>
<polygon class="st0" points="48.57,726.4 90.94,574.2 37.98,436.04 37.98,318.21 136.84,148.72 352.23,35.73 567.62,81.63 
	724.79,256.41 753,436.04 700.03,586.56 572.92,726.4 346.94,756.05 191.57,718.97 105.06,740.16 59.16,768.41 37.98,768.41 "/>
<path class="st1" d="M677.32,116.28C602.81,41.06,501.07-0.87,395.19,0.01C176.05,1.16-0.66,179.74,0.48,398.88
	c0.36,68.74,18.57,136.21,52.85,195.79L0,800l210.13-53.33c58.09,31.61,123.2,48.12,189.33,48h-4.27
	c219.14,1.43,397.94-175.06,399.37-394.2C795.26,293.83,753,191.41,677.32,116.28L677.32,116.28z M395.19,726.4
	c-59.17,0.05-117.24-15.99-168-46.4l-11.73-6.93L90.67,705.6L123.73,584l-7.47-12.27C20.24,417.1,67.76,213.89,222.4,117.86
	c129.6-80.48,297.49-61.5,405.86,45.88c62.11,61.61,96.89,145.58,96.53,233.06C724.49,578.72,577.1,726.11,395.19,726.4z"/>
<g>
	<g>
		<path class="st2" d="M322.49,176.44c7.66,11.08,14.92,21.57,22.71,32.83c-3.64,2.61-6.98,4.98-10.28,7.38
			c-63.46,45.97-85.2,130.73-50.46,198.21c18.07,35.11,48.23,53.84,86.17,61.28c1.45,0.28,3,0.04,5.35,0.04c0-3.35,0-6.42,0-9.49
			c0-62.71-0.11-125.42,0.11-188.12c0.04-10.4,0.62-20.97,2.47-31.18c9.46-52.04,49.81-79.28,101.57-68.3
			c42.11,8.94,73.44,34,92.17,71.67c34.53,69.46,31.7,138.31-14.27,202.06c-28.65,39.73-70.6,59.38-118.51,66.27
			c-6.91,0.99-8.96,3.13-8.9,10.08c0.34,36.58,0.16,73.16,0.15,109.74c0,2.81,0,5.62,0,8.97c-18.44,0-36.05,0-54.8,0
			c0-3.22,0-6.25,0-9.27c0.04-36.58-0.08-73.16,0.25-109.73c0.06-6.61-1.77-8.72-8.56-9.48c-45-5.04-85.07-21.17-116.38-55.05
			c-30.38-32.87-42.1-72.85-41.51-116.67c1.04-77.25,39.09-131.69,105.52-168.09C317.34,178.47,319.56,177.71,322.49,176.44z
			 M431.18,476.18c2.12,0,3.67,0.23,5.14-0.03c28.49-5.22,52.76-17.91,71.24-40.64c18.65-22.94,27.13-49.79,29.32-78.8
			c2.88-38.16-4.37-73.94-27.15-105.48c-10.64-14.74-23.87-26.36-42.48-30.03c-15.47-3.05-27.25,2.98-31.94,18.04
			c-2.82,9.07-4.28,18.93-4.33,28.45c-0.36,66.89-0.2,133.79-0.18,200.68C430.81,470.9,431.04,473.44,431.18,476.18z"/>
	</g>
</g>
</svg>
