<?xml version="1.0" encoding="UTF-8" standalone="no"?>
<svg
   version="1.1"
   id="Layer_1"
   x="0px"
   y="0px"
   viewBox="0 0 200 200"
   enable-background="new 0 0 2560 1600"
   xml:space="preserve"
   sodipodi:docname="fond.svg"
   inkscape:export-filename="fond.png"
   inkscape:export-xdpi="200"
   inkscape:export-ydpi="200"
   width="200"
   height="200"
   inkscape:version="1.2.2 (b0a8486541, 2022-12-01)"
   xmlns:inkscape="http://www.inkscape.org/namespaces/inkscape"
   xmlns:sodipodi="http://sodipodi.sourceforge.net/DTD/sodipodi-0.dtd"
   xmlns="http://www.w3.org/2000/svg"
   xmlns:svg="http://www.w3.org/2000/svg"><defs
   id="defs18521"><clipPath
     clipPathUnits="userSpaceOnUse"
     id="clipPath20896"><rect
       style="fill:none;fill-opacity:1;stroke:#ff0000;stroke-width:0.1;stroke-linecap:round;stroke-linejoin:round;-inkscape-stroke:none;paint-order:markers fill stroke;stop-color:#000000"
       id="rect20898"
       width="304.29434"
       height="304"
       x="88"
       y="584" /></clipPath></defs><sodipodi:namedview
   id="namedview18519"
   pagecolor="#ffffff"
   bordercolor="#666666"
   borderopacity="1.0"
   inkscape:showpageshadow="2"
   inkscape:pageopacity="0.0"
   inkscape:pagecheckerboard="0"
   inkscape:deskcolor="#d1d1d1"
   showgrid="false"
   showguides="true"
   inkscape:zoom="3.337544"
   inkscape:cx="141.87079"
   inkscape:cy="110.26072"
   inkscape:window-width="1920"
   inkscape:window-height="1007"
   inkscape:window-x="0"
   inkscape:window-y="0"
   inkscape:window-maximized="1"
   inkscape:current-layer="Layer_1"><sodipodi:guide
     position="-331.49116,649.32004"
     orientation="1,0"
     id="guide19687"
     inkscape:locked="false" /><sodipodi:guide
     position="-27.196801,649.32004"
     orientation="1,0"
     id="guide19689"
     inkscape:locked="false" /><sodipodi:guide
     position="-331.49116,649.32004"
     orientation="0,-1"
     id="guide19691"
     inkscape:locked="false" /><sodipodi:guide
     position="-331.49116,345.32002"
     orientation="0,-1"
     id="guide19695"
     inkscape:locked="false" /></sodipodi:namedview>

<path
   style="opacity:0.98;fill:#f2f2f2;fill-opacity:1;stroke-width:0.315707"
   d="m 120.82019,198.10427 v -1.89574 H 105.04732 89.274445 V 163.82306 131.4376 h 3.798127 3.798127 l 1.200348,-1.26382 c 1.011981,-1.0655 1.399356,-1.26383 2.468483,-1.26383 2.4395,0 4.05203,2.31978 3.13709,4.51297 -0.56877,1.36341 -1.62107,2.1221 -2.94332,2.1221 -1.437976,0 -2.597374,-0.60775 -3.13099,-1.64132 -0.455014,-0.88125 -0.475598,-0.88632 -3.604101,-0.88632 h -3.146477 v 30.80568 30.80569 h 15.772878 15.77287 v 2.68563 c 0,2.65402 -0.009,2.68562 -0.78864,2.68562 -0.7536,0 -0.78865,-0.0842 -0.78865,-1.89573 z m 10.4101,-5.21031 v -7.10605 l -15.69401,-0.082 -15.694012,-0.082 -0.08102,-21.87993 -0.08103,-21.87994 h 5.364942 5.36494 v -9.63665 -9.63665 h -5.36278 -5.362784 V 118.534 c 0,-3.99928 -0.01091,-4.06168 -0.773468,-4.40963 -1.093073,-0.49888 -1.857801,-2.12144 -1.638302,-3.47617 0.650782,-4.01665 6.491994,-3.63467 6.607094,0.43207 0.0394,1.39238 -0.62244,2.56517 -1.72297,3.05306 l -0.89506,0.39678 v 3.24046 3.24039 h 5.36278 5.36277 v 11.21643 11.21643 h -5.36277 -5.36278 v 20.37914 20.37915 h 15.77287 15.77287 v 7.8989 V 200 h -0.78864 -0.78864 z m 10.72555,-0.79285 v -7.8989 h 5.99369 5.99369 v 7.8989 V 200 h -0.78865 -0.78864 v -7.109 -7.10901 h -4.41641 -4.4164 V 192.891 200 h -0.78864 -0.78864 z m 20.82018,-4.58136 v -12.48026 h -24.10133 -24.10133 l -0.63891,1.08459 c -1.08395,1.84005 -3.69226,2.13658 -5.23164,0.59479 -2.29311,-2.29674 -0.29708,-6.19524 2.90545,-5.67477 1.16054,0.18865 2.58733,1.28976 2.58733,1.99678 0,0.34432 4.46244,0.41884 25.07886,0.41884 h 25.07886 V 186.72986 200 h -0.78865 -0.78864 z m 10.72555,9.79463 v -2.68563 h 5.99369 5.99369 v 2.68563 c 0,2.65402 -0.009,2.68562 -0.78864,2.68562 -0.75362,0 -0.78864,-0.0842 -0.78864,-1.89573 v -1.89574 h -4.41641 -4.4164 v 1.89574 c 0,1.81148 -0.0348,1.89573 -0.78864,1.89573 -0.77938,0 -0.78865,-0.0316 -0.78865,-2.68562 z m 20.82019,0 v -2.68563 h 2.83912 c 2.81808,0 2.83911,0.007 2.83911,0.78989 0,0.76152 -0.0736,0.78989 -2.05047,0.78989 h -2.05047 v 1.89574 c 0,1.81148 -0.0348,1.89573 -0.78864,1.89573 -0.77938,0 -0.78865,-0.0316 -0.78865,-2.68562 z m -116.815775,0.78166 c -0.446892,-0.3521 -0.901473,-0.92082 -1.010167,-1.26383 -0.195328,-0.61637 -0.642732,-0.62368 -38.346726,-0.62368 H 0 v -0.78989 -0.78989 h 38.170346 c 32.650196,0 38.170352,-0.0645 38.170352,-0.44582 0,-0.24527 0.436764,-0.81399 0.97057,-1.26383 1.376709,-1.16028 3.098193,-1.12019 4.466089,0.10394 0.884483,0.79153 1.030218,1.1304 1.030218,2.3956 0,1.26521 -0.145728,1.60407 -1.030218,2.3956 -1.267074,1.13389 -3.041213,1.25093 -4.271372,0.2818 z m 0.203568,-10.39771 c -0.54839,-0.33492 -1.090089,-0.90245 -1.203785,-1.26126 l -0.20673,-0.65238 -35.546995,-0.0803 -35.5469959,-0.0804 -0.081329,-18.65126 -0.081342,-18.65127 -2.5211816,-2.51033 C 0.32602523,143.62539 6.5720292e-6,143.15752 6.5720292e-6,142.19313 v -1.10756 L 3.3123027,144.39179 6.6246055,147.698 v 18.25211 18.2521 H 41.405644 76.186683 l 0.405796,-0.91818 c 0.23012,-0.52073 0.897647,-1.15199 1.541943,-1.4582 0.955054,-0.45392 1.332466,-0.48111 2.367692,-0.17042 1.332847,0.39995 2.459917,1.82616 2.462007,3.11539 0.0026,1.76382 -1.771057,3.54055 -3.532052,3.53765 -0.398995,-6.6e-4 -1.174126,-0.27521 -1.722516,-0.61012 z m 94.626277,-0.007 c -1.42633,-0.87099 -1.94328,-2.66628 -1.21214,-4.20946 1.17402,-2.47788 4.53437,-2.68661 5.90109,-0.36651 l 0.64005,1.08656 h 8.32847 8.32847 v -15.40468 -15.40462 l -10.17528,-10.1878 -10.17527,-10.18773 h -8.75217 c -4.93448,0 -8.75217,0.12322 -8.75217,0.28252 0,0.15541 -0.41187,0.72413 -0.91522,1.26382 -0.77143,0.82715 -1.14689,0.98131 -2.39018,0.98131 -1.20965,0 -1.64084,-0.16614 -2.39709,-0.92358 -0.75499,-0.75619 -0.92212,-1.19004 -0.92212,-2.39396 0,-1.20392 0.16713,-1.63777 0.92212,-2.39396 0.74593,-0.74717 1.19329,-0.92358 2.34168,-0.92358 1.16457,0 1.59392,0.17464 2.39019,0.97216 0.53384,0.53469 0.97062,1.10341 0.97062,1.26382 0,0.17148 3.73797,0.29167 9.07117,0.29167 h 9.07111 l 10.64498,10.66522 10.64491,10.66522 v 16.50697 16.50698 h -9.2847 c -9.11093,0 -9.28864,0.0125 -9.49191,0.6537 -0.25901,0.81727 -1.94329,1.87158 -2.98995,1.87158 -0.43375,0 -1.24224,-0.27699 -1.79666,-0.61559 z M 15.560534,177.65956 c -0.947772,-0.17957 -2.231834,-1.53818 -2.466929,-2.61026 -0.481519,-2.19576 1.624573,-4.37118 3.877432,-4.00507 1.160541,0.18866 2.587322,1.28976 2.587322,1.99678 0,0.34321 3.446214,0.41884 19.085173,0.41884 h 19.085173 v -24.15949 -24.1595 l -0.709779,-0.36407 c -1.837086,-0.94227 -2.431356,-3.52607 -1.17803,-5.12191 2.007919,-2.55674 5.988755,-1.15587 5.988755,2.10743 0,1.03851 -0.207118,1.43977 -1.26183,2.44471 l -1.261829,1.20221 v 24.81523 24.81517 H 39.598007 19.890016 l -0.45437,0.88006 c -0.645505,1.2502 -2.370682,2.02482 -3.875112,1.73987 z m 52.046627,-0.23164 c -1.978115,-0.87579 -2.583372,-3.53166 -1.184352,-5.19688 1.49193,-1.77587 4.664715,-1.52666 5.557795,0.43648 0.350913,0.7714 0.446464,0.79233 3.622088,0.79233 h 3.261665 v -26.22433 -26.22433 h 5.205041 5.205047 v -4.58136 -4.58136 H 75.630912 61.98738 l -0.524573,0.92352 c -0.288519,0.50789 -0.980041,1.15942 -1.536738,1.44773 -3.256769,1.68681 -6.275979,-2.51797 -3.800519,-5.29285 0.792002,-0.88784 1.127294,-1.03186 2.402005,-1.03186 1.319867,0 1.593086,0.12928 2.504107,1.18483 l 1.022588,1.18484 h 14.398744 14.398745 v 6.16114 6.16113 h -5.205048 -5.205047 v 26.22433 26.22433 h -4.050308 c -3.990859,0 -4.055475,0.0112 -4.402038,0.77317 -0.710397,1.56161 -2.780086,2.32445 -4.38213,1.61513 z m 105.736679,0.22203 c -0.94289,-0.21538 -2.30947,-1.63376 -2.52622,-2.62197 -0.47673,-2.17404 1.64163,-4.34789 3.8821,-3.98375 1.16055,0.18866 2.58734,1.28976 2.58734,1.99678 0,0.32122 0.77189,0.41884 3.3123,0.41884 h 3.31231 v -7.34841 -7.34834 l -7.65221,-7.65956 -7.65221,-7.65949 h -5.99132 -5.99133 l -0.54489,0.95899 c -1.69709,2.9869 -6.23744,1.77192 -6.23744,-1.6689 0,-1.75033 1.61619,-3.40133 3.32958,-3.40133 0.97155,0 1.40031,0.22722 2.38486,1.26382 l 1.20038,1.26382 h 6.24514 6.2452 l 8.12079,8.1381 8.12073,8.1381 v 8.44958 8.44958 h -3.93513 -3.93507 l -0.48455,0.93852 c -0.67199,1.30154 -2.28891,2.01468 -3.79036,1.6718 z M 24.824598,166.50059 c -0.446898,-0.35209 -0.901478,-0.92081 -1.010173,-1.26382 -0.182801,-0.57688 -0.491963,-0.62368 -4.119598,-0.62368 H 15.77287 V 148.8153 133.01751 h -3.291042 c -2.9994939,0 -3.3085567,0.0553 -3.4886829,0.62368 -0.523909,1.65331 -3.0171792,2.4012 -4.846451,1.45373 -2.1774973,-1.12783 -2.0644518,-4.8182 0.178963,-5.84196 1.7772541,-0.81102 4.169315,-0.0112 4.667488,1.56109 0.1833464,0.57859 0.492659,0.62368 4.2773259,0.62368 h 4.079686 v 15.79779 15.79779 h 3.133314 c 2.842461,0 3.151662,-0.0579 3.330954,-0.62369 0.339623,-1.07174 1.709818,-1.90455 3.120859,-1.89692 2.586646,0.0138 4.076637,2.47032 2.971754,4.8991 -0.765931,1.68371 -3.565964,2.2835 -5.08244,1.08879 z m 10.317357,-0.43411 c -0.765727,-0.76691 -1.072555,-1.35894 -1.072555,-2.06938 0,-1.34215 0.723948,-2.65659 1.711356,-3.10722 0.794111,-0.36237 0.812303,-0.44162 0.812303,-3.537 v -3.16633 h -5.205041 -5.205047 v -25.09723 c 0,-24.70912 -0.0097,-25.10025 -0.622687,-25.29509 -1.102188,-0.35038 -1.900972,-1.71017 -1.900972,-3.23604 0,-1.170354 0.166726,-1.566352 0.979732,-2.327016 2.22427,-2.081095 5.644873,-0.521656 5.644873,2.573396 0,1.14323 -0.989853,2.70004 -1.900939,2.98966 -0.612875,0.19478 -0.62272,0.58209 -0.62272,24.5052 v 24.30734 h 5.205047 5.205041 l 0.002,3.87045 0.002,3.87046 0.957485,0.54575 c 2.982223,1.69978 1.769151,6.2473 -1.666272,6.2473 -1.001906,0 -1.464281,-0.21379 -2.32339,-1.07425 z m 10.983214,0.58116 c -1.08079,-0.75822 -1.732327,-2.26277 -1.505139,-3.47571 0.182854,-0.97623 1.708767,-2.66627 2.407328,-2.66627 0.176163,0 0.291252,-12.95438 0.291252,-32.78271 V 94.940298 l 8.125263,-8.133623 8.125263,-8.133558 h 5.910264 37.91026 l 0.20715,-0.653699 c 0.25208,-0.795481 1.93315,-1.871116 2.92674,-1.872762 1.761,0 3.53494,1.773828 3.53204,3.537652 0,1.280805 -1.12946,2.715574 -2.44368,3.109926 -1.64872,0.494734 -3.44548,-0.225976 -3.95875,-1.587941 l -0.3593,-0.953397 H 69.74231 64.190751 l -7.647423,7.664297 -7.647431,7.664297 v 32.34959 32.34966 l 1.182966,1.02416 c 1.053897,0.91245 1.182965,1.18615 1.182965,2.50809 0,1.27673 -0.143809,1.61256 -1.030212,2.40581 -1.183182,1.05885 -2.945991,1.24289 -4.106447,0.42884 z m 20.562526,-0.58116 c -0.765727,-0.76691 -1.072555,-1.35894 -1.072555,-2.06938 0,-1.34215 0.723948,-2.65659 1.711356,-3.10722 l 0.812303,-0.37066 v -17.85828 c 0,-15.16338 -0.06717,-17.85828 -0.445137,-17.85828 -0.736994,0 -2.078522,-1.86111 -2.078522,-2.88356 0,-2.96478 3.328831,-4.68845 5.485186,-2.84018 1.775881,1.52212 1.621175,4.3261 -0.301354,5.46222 l -1.082879,0.63988 0.002,17.58333 0.002,17.58333 0.957485,0.54575 c 2.982223,1.69978 1.769151,6.2473 -1.666272,6.2473 -1.001906,0 -1.464281,-0.21379 -2.32339,-1.07425 z m 42.136995,0.16687 c -1.13215,-1.13396 -1.44015,-2.3024 -0.93129,-3.53285 0.57719,-1.39567 1.75655,-2.19484 3.239,-2.19484 1.06912,0 1.4565,0.19833 2.46848,1.26382 l 1.20035,1.26383 h 28.06709 c 27.66637,0 28.0699,-0.009 28.26469,-0.62369 0.33261,-1.04963 1.71182,-1.90396 3.07354,-1.90396 1.01085,0 1.46445,0.21393 2.36376,1.11467 1.01341,1.015 1.09694,1.23394 0.93436,2.44865 -0.23988,1.79154 -1.62968,3.07175 -3.33459,3.07175 -1.3244,0 -2.70873,-0.86789 -3.03707,-1.90396 -0.19479,-0.61486 -0.59963,-0.62368 -28.56752,-0.62368 -24.21309,0 -28.3699,0.0652 -28.3699,0.44582 0,0.24526 -0.43677,0.81398 -0.97058,1.26383 -1.38412,1.16653 -3.18287,1.13 -4.40032,-0.0894 z m 0.41962,-10.13712 c -1.42627,-0.87105 -1.94322,-2.66633 -1.2121,-4.20951 1.17399,-2.47789 4.53434,-2.68661 5.90107,-0.36651 l 0.64008,1.08656 h 8.32846 8.32847 v -23.4609 -23.4609 l 15.77286,-15.795423 15.77287,-15.795419 v -5.937993 -5.93806 l -1.26183,-1.202211 c -0.96247,-0.916996 -1.26183,-1.443655 -1.26183,-2.219787 0,-2.088468 1.3382,-3.485782 3.34865,-3.496643 1.59589,-0.0086 2.77557,0.843997 3.2782,2.369471 0.30533,0.926672 0.27122,1.291666 -0.21373,2.285742 -0.31742,0.650606 -0.96753,1.368418 -1.44466,1.595116 l -0.86751,0.412191 v 6.382043 6.382043 l -15.77287,15.795419 -15.77286,15.795421 v 23.93483 23.93484 h -9.22713 -9.22713 l -0.53902,0.94872 c -0.91212,1.60538 -2.84528,2.0102 -4.56998,0.95695 z m 53.003,0.30082 c -0.3775,-0.15245 -1.00757,-0.71215 -1.39998,-1.24381 l -0.71359,-0.96669 h -9.08898 -9.08892 V 132.4634 110.74026 l 15.77287,-15.795421 15.77286,-15.795418 -0.007,-13.903239 -0.007,-13.903238 -1.0184,-0.473934 c -0.73062,-0.339982 -1.14433,-0.838599 -1.46379,-1.764152 -0.40464,-1.17213 -0.39018,-1.403568 0.15773,-2.527646 1.18625,-2.433913 4.44709,-2.609532 5.84424,-0.314771 0.32584,0.535216 0.59247,1.328528 0.59247,1.762967 0,1.048315 -1.05264,2.735256 -1.86863,2.994668 -0.64728,0.205767 -0.65273,0.326291 -0.65273,14.484334 v 14.276922 l -15.77287,15.795419 -15.77284,15.795419 v 20.6173 20.6173 h 8.35151 8.35153 l 0.50224,-0.97275 c 0.59483,-1.15206 2.35495,-1.99006 3.60324,-1.71544 1.0698,0.23532 2.3846,1.60294 2.65773,2.76454 0.59431,2.52712 -2.22791,4.73282 -4.75203,3.71393 z M 36.061428,145.83755 c -1.142922,-0.51192 -1.992022,-1.91917 -1.992022,-3.30141 0,-1.02245 1.341516,-2.88356 2.078516,-2.88356 0.379502,0 0.445143,-3.7161 0.445143,-25.19925 V 89.254081 L 47.083766,78.750329 57.574466,68.246577 H 73.424459 89.274452 V 49.300355 40.354134 l -0.70978,-0.364073 c -1.209864,-0.620524 -1.799401,-1.625132 -1.806861,-3.078989 -0.0059,-1.095116 0.176466,-1.550882 0.91509,-2.29068 2.005882,-2.009083 5.702497,-0.687401 5.702497,2.038837 0,1.530344 -0.585791,2.685163 -1.638703,3.230516 l -0.884956,0.458399 v 9.739073 19.739139 H 74.524971 58.198204 L 48.184278,79.859795 38.170346,89.893167 v 24.690563 24.69049 l 1.08288,0.63988 c 1.872831,1.10677 2.135127,3.69332 0.530652,5.23295 -1.063184,1.02021 -2.423068,1.27245 -3.72245,0.6905 z m 84.247192,-0.007 c -2.52184,-1.09932 -2.76009,-4.59709 -0.40791,-5.98874 l 0.91949,-0.54404 V 125.5716 111.84536 h -3.12342 -3.12342 l -0.64008,1.08656 c -1.98484,3.36934 -7.18969,1.02956 -6.066,-2.72689 0.40676,-1.3598 1.82956,-2.46472 3.17373,-2.46472 1.04271,0 2.86497,1.13428 3.06731,1.90923 0.14897,0.57056 0.46104,0.61605 4.225,0.61605 h 4.06417 v 14.38862 14.38869 l 1.26182,1.20221 c 1.0547,1.00494 1.26183,1.4062 1.26183,2.44471 0,1.52337 -0.69263,2.57293 -2.08157,3.15416 -1.26394,0.52896 -1.28698,0.52883 -2.53096,-0.0132 z m 69.28313,-12.96814 -10.2506,-10.27455 h -6.18145 -6.18145 l -0.35239,0.77468 c -0.81809,1.79825 -3.7619,2.22354 -5.30981,0.76705 -2.34135,-2.203 -0.13571,-6.50237 2.96103,-5.77179 0.98948,0.23342 2.59989,1.61816 2.59989,2.23546 0,0.32912 1.35252,0.41482 6.54758,0.41482 h 6.54759 l 10.03791,10.0574 c 9.40221,9.42055 10.03135,10.12118 9.935,11.06444 -0.0998,0.97716 -0.40628,0.70274 -10.3533,-9.26751 z m -38.22707,-8.28785 c -2.16745,-1.34676 -1.92133,-5.20767 0.37855,-5.93878 0.47161,-0.14988 0.6227,-0.48052 0.6227,-1.36262 0,-1.11625 0.65721,-1.82287 15.77287,-16.96018 L 183.91167,84.51756 V 65.956951 47.393365 h 8.04417 c 7.83386,0 8.04416,-0.192731 8.04416,0.631911 0,0.613613 -0.2103,0.631912 -7.25552,0.631912 h -7.25552 v 18.24763 18.247631 l -15.77287,15.795421 c -12.99218,13.01073 -15.77287,15.94503 -15.77287,16.64422 0,0.56753 0.2063,0.91429 0.6227,1.04667 1.04797,0.33313 1.90096,1.71452 1.90096,3.07839 0,1.00349 -0.21346,1.46663 -1.07256,2.32708 -1.22397,1.22591 -2.61803,1.41042 -4.02964,0.53331 z m 42.4839,0.24224 c -1.72575,-0.70742 -2.49126,-2.98638 -1.58971,-4.73256 0.62356,-1.20768 2.30672,-2.02304 3.56401,-1.72644 0.98942,0.23342 2.59983,1.61816 2.59983,2.23546 0,0.23183 0.34786,0.41482 0.78865,0.41482 0.63091,0 0.78864,0.15798 0.78864,0.78989 0,0.62605 -0.15911,0.78989 -0.76735,0.78989 -0.49888,0 -0.83991,0.22874 -0.97457,0.6537 -0.43441,1.37092 -2.82485,2.22485 -4.4095,1.57524 z M 6.5720292e-6,121.80345 v -0.79496 H 7.8864416 15.772877 V 105.2107 89.412915 l 3.864353,-0.01185 3.864353,-0.01185 0.636534,-1.014679 c 1.766824,-2.816416 6.1458,-1.590771 6.1458,1.720182 0,1.668312 -1.610423,3.426277 -3.138696,3.426277 -1.318323,0 -2.618493,-0.704779 -3.156046,-1.710835 -0.423929,-0.793312 -0.525513,-0.816811 -3.534799,-0.816811 h -3.098324 l -0.08181,15.718801 -0.08181,15.7188 -8.5962142,0.0841 -8.5962142279708,0.0841 z M 172.65648,114.17963 c -3.34661,-1.65297 -1.8056,-6.77981 1.90135,-6.32583 1.23968,0.15186 2.72924,1.23974 2.72924,1.99336 0,0.34004 2.13578,0.41884 11.35646,0.41884 H 200 v 0.78988 0.78989 h -11.19066 -11.19058 l -0.50224,0.97275 c -0.46379,0.89824 -2.07374,1.88106 -3.05277,1.86368 -0.22246,-0.007 -0.85575,-0.23012 -1.40727,-0.50257 z M 0,111.05845 c 0,-0.77672 0.04206099,-0.78989 2.5236592,-0.78989 H 5.0473184 L 5.0351602,96.603476 5.0230019,82.938389 4.021267,82.306477 c -1.954699,-1.233083 -1.9242902,-4.106767 0.057637,-5.44451 1.2501774,-0.843865 1.9270109,-0.890403 3.3198671,-0.22841 2.4263406,1.153173 2.5020109,4.84867 0.1208925,5.904292 L 6.6245989,82.934637 V 97.391522 111.84834 H 3.3122962 0 Z m 56.127154,-8.03258 c -0.756217,-0.75737 -0.922108,-1.18931 -0.922108,-2.40087 0,-1.245261 0.15391,-1.621314 0.979738,-2.393957 1.592146,-1.489666 4.415497,-1.061743 5.261238,0.797393 l 0.370104,0.813586 h 28.218946 29.649598 l 18.56934,-19.43821 0.20716,-1.215489 c 0.26826,-0.846564 1.95594,-1.871248 3.08446,-1.872762 1.24399,0 2.55573,0.754147 2.99864,1.727751 1.13035,2.484798 -0.28541,4.906138 -2.86863,4.906138 -1.51634,0 -1.99872,-2.736445 -2.80026,-1.90397 l -18.69497,19.41643 -30.138575,-0.0401 c -16.373513,-0.0218 -28.212184,0.11855 -28.212184,0.28252 0,0.15541 -0.411843,0.72413 -0.915208,1.26382 -0.771431,0.82715 -1.146917,0.98131 -2.390194,0.98131 -1.209641,0 -1.640872,-0.16614 -2.397095,-0.92358 z m 126.182976,0 c -0.7224,-0.72354 -0.92212,-1.20702 -0.92212,-2.23243 0,-1.636976 0.39576,-2.393164 1.57097,-3.001839 1.76039,-0.911796 3.95729,-0.329911 4.67002,1.236835 0.36179,0.795353 0.44093,0.813586 3.53142,0.813586 h 3.16134 V 78.830964 57.819905 h 2.83912 c 2.81808,0 2.83911,0.0066 2.83911,0.78989 0,0.761519 -0.0736,0.789889 -2.05047,0.789889 h -2.05047 V 80.410742 101.4218 h -3.92192 c -3.62763,0 -3.93684,0.0467 -4.11961,0.62368 -0.34911,1.10164 -1.70768,1.90397 -3.22398,1.90397 -1.12822,0 -1.58103,-0.18003 -2.32341,-0.92358 z M 66.687695,92.448657 c -1.263683,-1.265666 -1.412093,-2.629542 -0.456868,-4.198591 1.238006,-2.033636 4.416266,-1.919168 5.621747,0.202409 l 0.5449,0.958992 h 18.441213 6.12341 l 0.63892,-1.084584 c 1.349921,-2.291528 4.604163,-1.996183 5.836503,0.529752 0.75403,1.54555 0.28921,3.167522 -1.16171,4.053581 -1.64651,1.005595 -2.950843,0.808715 -4.341223,-0.655148 l -1.20035,-1.263823 h -6.06709 -18.384881 l -0.207157,0.6537 c -0.284148,0.896722 -1.979751,1.871314 -3.258077,1.872762 -0.78215,0 -1.335508,-0.277976 -2.129337,-1.073065 z M 14.893552,82.620326 c -2.28169,-0.992891 -2.454823,-4.53278 -0.286461,-5.85703 0.554429,-0.338599 1.36294,-0.615587 1.796694,-0.615587 1.046642,0 2.730954,1.054305 2.989938,1.871577 0.20044,0.632504 0.413414,0.6537 6.575696,0.6537 h 6.368547 L 42.744478,68.246445 53.150991,57.819905 h 12.856683 12.856677 l -0.002,-13.665087 -0.002,-13.665087 -0.922063,-0.525408 c -3.127563,-1.78199 -1.91384,-6.267641 1.695682,-6.267641 3.23171,0 4.470531,3.865653 1.897726,5.921736 l -1.090253,0.871313 -7e-6,14.454977 -1.3e-5,14.454976 H 67.111617 53.781748 L 43.375235,69.826224 32.968723,80.252765 h -6.539426 -6.539438 l -0.502235,0.972748 c -0.465319,0.901264 -2.086212,1.888034 -3.052727,1.858479 -0.22245,-0.0066 -0.871123,-0.215443 -1.441502,-0.463666 z M 3.9012748,71.793905 C 2.1721674,70.391061 2.0473185,68.344392 3.5962144,66.793049 c 0.8591088,-0.860453 1.3214839,-1.07425 2.3233898,-1.07425 1.3617639,0 2.7409305,0.854332 3.0735409,1.903963 0.1903194,0.600579 0.5121122,0.623683 8.6937299,0.623683 h 8.496089 V 54.523631 c 0,-13.384808 -0.01531,-13.72762 -0.622686,-13.920682 -1.070051,-0.340179 -1.901584,-1.712546 -1.89396,-3.12579 0.01452,-2.693128 2.713551,-4.206359 5.043618,-2.827804 2.216607,1.31148 2.002307,5.213138 -0.326998,5.953594 -0.608037,0.19326 -0.622687,0.539363 -0.622687,14.710571 v 14.512704 h -9.284732 c -8.9667851,0 -9.291509,0.02106 -9.4823739,0.623684 -0.5442561,1.717483 -3.6281808,2.53153 -5.0918703,1.343997 z M 151.00755,71.713735 c -0.4469,-0.352093 -0.90148,-0.920814 -1.01018,-1.263823 -0.19454,-0.614073 -0.58505,-0.623684 -25.25522,-0.623684 H 99.684539 V 50.224329 30.622367 L 98.42271,29.420155 c -0.962454,-0.916995 -1.26183,-1.443654 -1.26183,-2.219786 0,-2.088468 1.33817,-3.485782 3.34863,-3.496643 1.58646,-0.0086 2.77509,0.842483 3.26868,2.340442 0.46501,1.411269 -0.22496,3.141719 -1.55488,3.899816 l -0.95749,0.545747 -0.002,18.878357 -0.002,18.878357 h 24.23691 24.23694 l 0.43645,-0.816811 c 1.18829,-2.223802 4.9032,-2.212414 5.91792,0.01777 1.13032,2.484794 -0.28543,4.906134 -2.86863,4.906134 -0.92968,0 -1.67481,-0.215442 -2.21385,-0.640139 z M 35.141955,60.853081 c -0.793823,-0.79509 -1.072247,-1.349329 -1.071373,-2.132702 0.0013,-1.280345 0.974527,-2.978607 1.869802,-3.263231 0.646734,-0.205568 0.652675,-0.332411 0.652675,-13.930226 V 27.804107 h -8.51735 c -7.1222,0 -8.51735,0.073 -8.51735,0.445827 0,0.245261 -0.436757,0.813981 -0.970577,1.263823 -1.754127,1.478344 -4.128194,0.961098 -5.210561,-1.135268 -1.120518,-2.170287 0.568336,-4.691285 3.129633,-4.671735 1.447884,0.01119 2.026209,0.34268 2.874901,1.648696 l 0.56463,0.868879 h 9.11198 9.111981 l 0.002,14.454976 0.002,14.454976 0.957485,0.545748 c 2.118238,1.207412 2.232512,4.390666 0.20213,5.630661 -1.566601,0.956688 -2.928319,0.808057 -4.192002,-0.457609 z M 0,58.614863 V 57.819905 H 7.8864351 15.77287 V 49.2891 c 0,-5.00395 -0.120413,-8.530806 -0.291252,-8.530806 -0.160194,0 -0.723187,-0.364008 -1.251105,-0.808913 -2.387394,-2.012046 -0.934549,-5.826158 2.219263,-5.826158 3.293789,0 4.62126,4.569839 1.810528,6.23282 l -0.900821,0.532978 -0.08353,9.176342 -0.08352,9.176343 -8.5962208,0.08406 L 0,59.409821 Z m 110.39795,-8.456885 -0.0122,-9.241706 -1.01145,-0.637375 c -1.44938,-0.91331 -1.96907,-2.144089 -1.52798,-3.618681 0.46827,-1.565363 1.31245,-2.264218 2.95977,-2.450237 1.15062,-0.129871 1.52694,-0.02041 2.36801,0.688323 1.80002,1.517048 1.65592,4.314376 -0.28128,5.460505 l -0.90549,0.535743 v 8.462677 8.462678 h 17.74689 17.74694 l 7.64741,-7.664297 7.64741,-7.664297 V 21.245656 0 h 0.78864 0.78865 v 21.566285 21.566219 l -8.12527,8.133623 -8.12526,8.133557 h -18.84635 -18.84635 z m -64.025712,0.789429 c -0.803305,-0.401988 -1.225427,-0.903963 -1.549467,-1.842681 -0.404601,-1.17213 -0.390155,-1.403567 0.157728,-2.527646 0.466897,-0.958004 0.902931,-1.341232 1.930757,-1.697143 1.191233,-0.412454 1.440977,-0.405543 2.43054,0.06708 0.606586,0.289757 1.325881,0.958662 1.59843,1.486571 l 0.495544,0.959782 h 8.351518 8.351518 V 31.595577 15.797788 h 15.77287 15.77287 V 10.419695 5.0416667 l 6.072564,0.085769 6.07255,0.085835 0.0836,9.1908243 0.0835,9.190824 0.7545,0.404424 c 2.94615,1.579252 1.69695,6.332412 -1.66426,6.332412 -3.15381,0 -4.60665,-3.814113 -2.21925,-5.826159 0.52792,-0.444905 1.09091,-0.808913 1.2511,-0.808913 0.17083,0 0.29125,-3.526856 0.29125,-8.530805 V 6.6350711 h -4.57413 -4.57413 v 5.3712479 5.371248 H 85.488963 69.716093 v 15.639811 15.63981 h -9.140162 -9.140168 l -0.486632,0.942536 c -0.504377,0.976895 -1.917547,1.901461 -2.905067,1.900605 C 47.73182,51.5 46.9795,51.251185 46.372238,50.947407 Z m 73.939472,0.258425 c -2.0959,-0.894484 -2.66006,-3.711493 -1.09468,-5.466232 0.78129,-0.87579 1.13525,-1.031859 2.34052,-1.031859 1.49154,0 2.83255,0.875658 3.2217,2.103673 0.17046,0.53798 0.63026,0.581951 6.08146,0.581951 h 5.89705 l 5.35581,-5.371248 c 4.94432,-4.958597 5.44288,-5.371248 6.48896,-5.371248 0.89576,0 1.22456,-0.171077 1.56959,-0.816812 1.17147,-2.192403 4.73054,-2.244273 5.84523,-0.08524 1.26617,2.452409 -0.16102,5.009479 -2.79594,5.009479 -1.51637,0 -2.87493,-0.80233 -3.22404,-1.903963 -0.44848,-1.415284 -1.50709,-0.698657 -6.7797,4.589587 l -5.19788,5.21327 h -6.52807 c -6.06415,0 -6.54117,0.04147 -6.71248,0.581951 -0.49312,1.556148 -2.92302,2.625856 -4.46753,1.966693 z M 0,48.025276 C 0,47.446024 0.21030494,47.393365 2.5236592,47.393365 H 5.0473184 V 26.224329 5.0552923 H 45.845746 86.644174 L 87.080649,4.238415 c 0.537559,-1.00599 1.837723,-1.7107689 3.156053,-1.7107689 1.528266,0 3.138689,1.7579647 3.138689,3.426277 0,3.3109532 -4.378976,4.5365979 -6.145793,1.7201817 L 86.593057,6.659426 46.608831,6.6475777 6.6246055,6.6350711 V 27.64613 48.657188 H 3.3123027 C 0.21030494,48.657188 0,48.617038 0,48.025276 Z m 130.20504,-7.60828 c -0.30363,-0.177067 -0.76864,-0.741509 -1.03334,-1.254213 l -0.48127,-0.932135 h -3.93512 -3.93511 V 19.115324 0 h 0.78864 0.78865 v 18.325434 18.325435 h 3.00948 3.00948 l 1.20034,-1.263823 c 1.34704,-1.418247 2.51049,-1.632372 4.17768,-0.768892 3.01508,1.561612 1.71165,6.156069 -1.73922,6.13053 -0.71398,-0.0066 -1.54657,-0.154556 -1.85021,-0.331688 z m 41.76663,-0.457149 c -1.17212,-0.987822 -1.48745,-2.270208 -0.9028,-3.671208 0.59727,-1.431082 1.23633,-1.898829 2.84174,-2.080108 1.13867,-0.128555 1.51643,-0.01711 2.36574,0.698854 0.55593,0.468471 1.01071,1.052396 1.01071,1.297657 0,0.372828 1.39518,0.445827 8.51735,0.445827 h 8.51735 V 18.325434 0 h 0.78865 0.78864 v 19.115324 19.115324 h -9.13715 -9.13716 l -0.3635,0.7109 c -0.99954,1.954911 -3.58715,2.453068 -5.28957,1.018299 z M 47.316619,34.36019 l -0.002,-3.870459 -0.922068,-0.525408 c -3.127353,-1.78199 -1.913631,-6.267641 1.695892,-6.267641 3.254541,0 4.444111,4.060954 1.769683,6.041404 -0.958951,0.71011 -0.962224,0.723078 -0.962224,3.812664 v 3.100119 h 4.416404 4.416404 V 27.014218 17.377567 H 38.664825 c -18.998777,0 -19.064622,0 -19.271069,0.653699 -0.258984,0.817273 -1.943297,1.871578 -2.989938,1.871578 -2.355107,0 -3.979443,-2.588271 -3.039045,-4.842549 1.032828,-2.475777 4.556342,-2.683189 5.931323,-0.349065 l 0.640076,1.086558 h 19.684929 19.684924 v 11.21643 11.21643 h -5.993691 -5.993691 l -0.002,-3.870458 z M 172.1474,29.694905 c -0.97206,-0.765863 -1.59003,-2.467219 -1.30678,-3.597683 0.33123,-1.321748 1.86298,-2.401659 3.39492,-2.393496 1.40076,0.0072 2.4141,0.613546 3.0257,1.809702 0.34016,0.665284 0.56506,0.710901 3.50696,0.710901 h 3.14347 v -4.423381 -4.423381 h -5.20505 -5.20505 V 8.6887836 0 h 0.78865 0.78865 v 7.8988942 7.8988938 h 5.20504 5.20505 v 6.00316 6.003159 h -4.10095 c -3.32012,0 -4.10094,0.08491 -4.10094,0.445827 0,0.245261 -0.43678,0.813981 -0.97056,1.263823 -1.21208,1.021525 -3.00368,1.099329 -4.16911,0.181148 z M 131.23029,13.902054 V 0 h 0.78864 0.78864 v 13.112164 13.112165 h 9.77918 9.77918 V 13.112164 0 h 0.78864 0.78865 v 13.902054 13.902053 h -11.35646 -11.35647 z m 9.55976,5.385202 c -2.12876,-1.300092 -1.99365,-4.961229 0.2139,-5.795813 l 0.95189,-0.359861 V 6.5658241 0 h 0.78864 0.78864 v 6.6138099 c 0,6.4097551 0.0201,6.6201291 0.65269,6.8212221 0.79421,0.252501 1.86821,1.936216 1.86978,2.931345 0,1.763823 -1.77104,3.540548 -3.53204,3.537651 -0.39899,-6.58e-4 -1.17907,-0.278238 -1.7335,-0.616772 z M 183.69492,9.1069642 c -2.7222,-0.7255793 -3.13657,-5.0354792 -0.59556,-6.1951027 0.67673,-0.3087809 0.81231,-0.5826751 0.81231,-1.6412586 C 183.91167,0.12592154 183.98981,0 184.70032,0 c 0.70787,0 0.78864,0.12756714 0.78864,1.2459847 0,1.0412059 0.15109,1.3353081 0.91949,1.7899553 3.37454,1.9965771 1.09917,7.087283 -2.71353,6.0710242 z"
   id="path21684"
   sodipodi:nodetypes="scccccccsssscscccccsssccccccccccccscssscccccccccccccccccccccccccccccccccccccccsscssccccccscccssscccsssscssscsssssscccsscsssssscccccsscccccccssccssssscccccccsssssscsssscccccscssscscsscccscsccccccscccsscccccccccccssscccccccccscccccssscccccccsssscccccccccsccssscccscsssscccsscsscscscccscssscscccccsscccssscccccsccsscccccccsssccsccssscccccsscccssscscsscscsscsccscccccccccsscssscccccccccscccccccccccccsccsssscccccccsscccccsscccccccccsscccccccccccsccscccccsssssccccscccscccscsssccssccsscccssscccsssssccccsssssscccccccccssscscccccccssscccccsccsccccscsccccccscccsccccscsssscscscsccsscccssscccscssccccccsscscccsccccccssccccccccsccccccccccsccccccsscscsccscsccccccccssssccccccscscccccscsscccscccccccccccccsscssccccccccscccscccccccccccccccccccssccccccccccccccccssssscccccccccccsccssssscssssssscscsssscccccssscccccsscscccccccccccssccscccsscccccccccssccccsscccccscscccccccccccsccsscccccccccccccccsscsccscccccccccccccccscscccsscscscssscscss" /></svg>
