<?xml version="1.0" encoding="UTF-8" standalone="no"?>
<!-- Created with Inkscape (http://www.inkscape.org/) -->

<svg
   width="59"
   height="59"
   viewBox="0 0 15.610417 15.610417"
   version="1.1"
   id="svg5881"
   xml:space="preserve"
   inkscape:version="1.2.2 (b0a8486541, 2022-12-01)"
   sodipodi:docname="generateur.svg"
   xmlns:inkscape="http://www.inkscape.org/namespaces/inkscape"
   xmlns:sodipodi="http://sodipodi.sourceforge.net/DTD/sodipodi-0.dtd"
   xmlns="http://www.w3.org/2000/svg"
   xmlns:svg="http://www.w3.org/2000/svg"><sodipodi:namedview
     id="namedview5883"
     pagecolor="#ffffff"
     bordercolor="#666666"
     borderopacity="1.0"
     inkscape:showpageshadow="2"
     inkscape:pageopacity="0.0"
     inkscape:pagecheckerboard="0"
     inkscape:deskcolor="#d1d1d1"
     inkscape:document-units="mm"
     showgrid="false"
     inkscape:zoom="4.7572176"
     inkscape:cx="-30.374898"
     inkscape:cy="22.492139"
     inkscape:window-width="1920"
     inkscape:window-height="1007"
     inkscape:window-x="0"
     inkscape:window-y="0"
     inkscape:window-maximized="1"
     inkscape:current-layer="layer1" /><defs
     id="defs5878" /><g
     inkscape:label="Calque 1"
     inkscape:groupmode="layer"
     id="layer1"><g
       id="g557"><path
         style="fill:#ffffff;stroke:#000000;stroke-width:0.39026;stroke-linecap:butt;stroke-dasharray:none;paint-order:markers fill stroke;stop-color:#000000"
         d="M 7.8052083,-2.6666667e-7 V 15.610417"
         id="path16018" /><ellipse
         style="font-variation-settings:normal;opacity:1;vector-effect:none;fill:#ffffff;fill-opacity:1;stroke:#000000;stroke-width:0.439906;stroke-linecap:butt;stroke-linejoin:miter;stroke-miterlimit:4;stroke-dasharray:none;stroke-dashoffset:0;stroke-opacity:1;-inkscape-stroke:none;paint-order:markers fill stroke;stop-color:#000000;stop-opacity:1"
         id="path378"
         cx="7.8052082"
         cy="7.8052082"
         ry="6.3460875"
         rx="6.3946304" /><g
         id="g445"
         transform="translate(0,-3.3046461)"><path
           style="fill:#ffffff;stroke:#000000;stroke-width:0.390259;stroke-linecap:butt;stroke-dasharray:none;paint-order:markers fill stroke;stop-color:#000000"
           d="M 7.8052083,6.3959827 V 9.2144339"
           id="path16018-6" /><path
           style="fill:#ffffff;stroke:#000000;stroke-width:0.390259;stroke-linecap:butt;stroke-dasharray:none;paint-order:markers fill stroke;stop-color:#000000"
           d="M 9.2144337,7.8052083 H 6.3959829"
           id="path16018-6-7" /></g><path
         style="fill:#ffffff;stroke:#000000;stroke-width:0.390259;stroke-linecap:butt;stroke-dasharray:none;paint-order:markers fill stroke;stop-color:#000000"
         d="M 9.2144337,11.109855 H 6.3959829"
         id="path16018-6-7-1" /></g></g></svg>
