curl 'https://api.windfinder.com/v2/spots/fr74/reports/?limit=-1&timespan=2017-03-18T00%3A00%3A00%2B01%3A00%2FPT24H-1S&step=1m&customer=wfweb&version=1.0&token=79e325a37aa007c18bfb3c25cb3d9b0d&callback=jQuery21408293721864427742_1489920250550&_=1489920250551' -H 'Host: api.windfinder.com' -H 'User-Agent: Mozilla/5.0 (X11; Linux x86_64; rv:51.0) Gecko/20100101 Firefox/51.0' -H 'Accept: */*' -H 'Accept-Language: fr-FR,fr;q=0.8,en-US;q=0.5,en;q=0.3' --compressed -H 'Referer: https://www.windfinder.com/report/paris-cdg/2017-03-18' -H 'DNT: 1' -H 'Connection: keep-alive'

curl https://api.windfinder.com/v2/spots/fr74/reports/?limit=-1&timespan=PT-24H&step=1m&customer=wfweb&version=1.0&token=79e325a37aa007c18bfb3c25cb3d9b0d&callback=jQuery2140020680220956577622_1489919889632&_=1489919889633 -H Host: api.windfinder.com -H User-Agent: Mozilla/5.0 (X11; Linux x86_64; rv:51.0) Gecko/20100101 Firefox/51.0 -H Accept: */* -H Accept-Language: fr-FR,fr;q=0.8,en-US;q=0.5,en;q=0.3 --compressed -H Referer: https://www.windfinder.com/report/paris-cdg -H DNT: 1 -H Connection: keep-alive
