{
    "titre"     :   "Calcul@kart",
    "consigne"  :   "Clique sur la bonne réponse avant l'accident.",
	"opt1"      :   "Vitesse initiale (entre 5 et 10): ",
    "opt2"      :   "Accélération (entre 0.5 et 1.5): ",
    "opt3"      :   "Propositions (entre 3 et 5): ",
	"label3"	:	["3","4","5"],
	"opt4"		:	"Tirages dans la table de 4 et 5",
	"label4"	:	["0","1","2","3","4","5"],
	"opt5"		:	"Tirages dans la table de 6 et 7",
	"label5"	:	["0","1","2","3","4","5"],
	"opt6"		:	"Tirages dans la table de 8 et 9",
	"label6"	:	["0","1","2","3","4","5"],
	"opt7"		:	"Tirages dans les tables de 10",
	"label7"	:	["0","1","2","3","4","5"],
	"opt8"		:	"Tirages dans la table de 2 et 3",
	"label8"	:	["0","1","2","3","4","5"]
	
	
}