{
    "titre"     :   "La balance " ,
    "consigne"  :   "Cliquer sur les paquets pour les peser. Calculer l’écart entre le  paquet le plus lourd et le plus léger.",
    "consigne1" :   "Calcule l’écart entre le plus lourd et le plus léger :",
    "opt1"      :   "Nombre de questions : ",
    "opt2"      :   "Nombre d'essais : ",
    "label2"    :   ["un","deux"],
    "opt3"      :   "Temps maximum par question : ",
    "opt4"      :   "Type de calcul : ",
    "label4"    :   ["Ecart entre des dizaines","Ecart entre des centaines","Ecart entre une centaine et une dizaine"],
    "opt5"      :   "Nombre de caisses à peser : ",
    "label5"    :   ["deux","trois","quatre"]
}