<?xml version="1.0" encoding="UTF-8" standalone="no"?>
<!-- Created with Inkscape (http://www.inkscape.org/) -->
<svg id="svg8" xmlns:rdf="http://www.w3.org/1999/02/22-rdf-syntax-ns#" xmlns="http://www.w3.org/2000/svg" height="297mm" width="210mm" version="1.1" xmlns:cc="http://creativecommons.org/ns#" xmlns:xlink="http://www.w3.org/1999/xlink" viewBox="0 0 210 297" xmlns:dc="http://purl.org/dc/elements/1.1/">
 <defs id="defs2">
  <pattern id="pattern1618" xlink:href="#pattern1559" patternTransform="matrix(.24694 0 0 .42333 50.447 101.88)"/>
  <pattern id="pattern1616" xlink:href="#pattern827" patternTransform="matrix(.24694 0 0 .42333 68.968 65.477)"/>
  <pattern id="pattern1614" xlink:href="#pattern827" patternTransform="matrix(.24694 0 0 .42333 68.968 65.477)"/>
  <pattern id="pattern1612" xlink:href="#pattern1575" patternTransform="matrix(.24694 0 0 .42333 52.917 68.441)"/>
  <pattern id="pattern1586" xlink:href="#pattern1575" patternTransform="matrix(.24693 0 0 .45416 52.918 66.899)"/>
  <pattern id="pattern827" width="75" patternUnits="userSpaceOnUse" patternTransform="matrix(.26458 0 0 .26458 68.792 74.221)" height="37">
   <image id="image835" xlink:href="data:image/png;base64,iVBORw0KGgoAAAANSUhEUgAAAEsAAAAlCAIAAACF0oOXAAAAA3NCSVQICAjb4U/gAAAOpElEQVRo gWVZzZKrTHI9VYkELcii+guHN7P1chz2wuEH8MaPMI/g956wHd54uqgEiUbKKi8SaN1r4sZt/SDI n5MnTybuP/7y7wCoJwBwDAAAN6A+gkJZvnx3Z1/1XmZwfrk4+DSlOJKdWZFKrlIcgDEi+NHVnOsI QBe1c6gnOw0AKNiH0GyvqSeAdUnUR0DKeus9mm7Br4fd4rymPOU02IzJtfb3AsARP3N6tARAH6WZ +zA6jyqnb7sBSwKSWSglFGhVCQ2nuRw3ZUDKwiCEK8/t4uCSKLSAVF6IYwTktqonnhU+JId4W1X0 x+49shDqI4CUEl/00UWUAAj7Wl0AMKv85h77egZLF4Xm/nibvwXtnoDI/nDIsldFnogxnpczC3RJ 8gI3CD15BUC51uBOExmQAJcm5Qbu+qe8/jeAsnJVFYAUAEquFHC6565/8h39lic/juTMUGG/Q6Os Ot6qq7lAJ3X2a6kBNbDLR6jCz2XObF0YQDMsGUPcP/L1J92aKXya9fIUvrCFGZBcK9zPFXVJ0CzF wbG8wBC7tO/uwP4TAFIDLz/pqyoAAVxWDT0BmPL+wlw63a6qgAcw939gUWgGEFqujvHKACz68gKq sK+As4TJCz74hk73GkBRylQmhwuDQpoUVKAaY7ytegdmBYDgXFm1AMCtqvheAMe54j0lmlNy8bg2 gDiKLnrAcj/KqgDyogMEmjUDpI44STkCCuoliVI/6qJMAAXqqKzA678AOOJAqCrsMhx+O0ouHlXG UfZ0U/B+5AtbnLgBu8wuHwUgBp4jPz/HlCD1DSeafXDx8K+sWlYF2BEDnCatSPprPunmQQEUHLHZ bfgbCAPxGKKFCYDoT0FCc/4WSxcoSA3pPti3+ij6KACaHmlKEe4N1prxflCgnswhXRTszcna06xg 75MwIKgCrYC5GiKsgDWyn4Cz5IyH61HhA+SsTCbM4CN2HCA4UPPDMcfJVXfkg0J+AYA8RRelIQIR FGgAAHbZ/w98j8QuQ7NFYq9a3SEur90AgCN7V3f/Xc3sMw5brfbOI819mnsAUlxVua2Jfc6vHUbT xLnWH7trqC7QzYcfDMtAzL6W9bafdsb9eJGknKYa0Kind+PNfs8ICyIMk83xadhNsQ/LestmiXxV F6SEJKXKl3lbkdjXvUEBqOKD9/38Q3RA9WwR5QZpUgDBOepJFFJDaE5e2dlOF50V1QXffxpu+Rpw oBGaoTneZkuM/TCyf+/nVl8Amr3qKDAdMKhi3Zl6yrWWZcALvCT0NPd/oPBAmHualhEzqHclVx/c CAAOwAhMUwGABtDMPr4uPD8FT4whzmr0Kvh/R3XB1SwlAEI96ZLmPp7sZfg827UUd6KGGwBBngII dE+SzgkUaIiNEX0MtByyI8ZPAGlSpATH5z100ZPfzkPz1/vbsuwi40RgknL6MyvKqlXFVI5DHEMk xUD220Q3PxBmRZo0jhHAx+PrXd04YqtAvrC8EFrmM1hHS99fUDDUNLsayl8AfHBl4ePq6QhSpp7K yr1H07J8i6uZPaQnABXOIb61AZUaeMm7VMj4HGbTJVKcLokJIJCvUmJZbxnqOzprG8CUE/VkQqys Cv8TSzPaEVfAEJdfjt2etNDy3FGZ8PGtAB7dfe/4hnsKnyY+BfBjPPHgiMfbktIXSKmP9SUfm6bn 3qx0SQBTz8NFG79IcdTHsKrvIiAWNXPvtfalgEkA0M0nKVZdAAbCtPRVhfqIAkdaVviOBgJ6AtA/ FJ7nXzMplkmXR0wTRm7gO+qXJIApUnYVgDylOfWOlIBOsGi/JPTxBORJWbMKwMMHjR/7V/NBfSaU dVFHml8uAuxrpVponO49AN+RBzxFABWgXoB7WW9VZdYIgPpo+PQdpblgLuWNfnqP4cKPK5VVfXfX RS1AVaXQyMAMNvGAKjFGXVSeDkVgakheyLUCYqLhjO55yAuOuKw3K5i86KzWqXggHo5CpZ6qCjQD kqRMGI0erHIAlCXNKrNCF9VlL0hAzhMGQlk1NPWdh31H9HGA9q03Wue8dySKqnLWp3H1XmKO6Z/+ +c8AXOtaF1AuG9re40ULsA3UXj2216VtWgO9v7irR3v160Nd4wFsFVcPh+/qwmN+ANhU1nVtqXXE y+3WNb4+V/u3VdRnrc+Veho797yMwAbAX70uj+11eZKvrwrA+XYPTd3qc/3+Xp+uDT2ta2bCtWFt aaD2+lrX73qmobsw6tYepfu4X/zFNTv/3kuqJTQH5IoDMCs+Nj0DHAcC4Oo+0ZRV92ox7vZH1B1z A+qprChzSQAQoJkb+F7KwsOFlxVJhXoAnObiB19qwXdmxVuFv3X5vUwwhr1ABgBA9ewsEJqBkF8O CnbH5PnhUcWPIRovxcH7jsbbAoB9ZV91SUtB5JPO2JxxNYeeQk8nPo2u7PahZcPSrtQ0x8HHMVIf rZfMT6kqjrisqkuKgw9AHJY4EvU0EAba/dwFFoXhwr3fUTrrPi4CcOVoFRRQxeK4SwJAH+W2vuhf /vEftorIfqsb0D7mx/Pit+q26lAGAO3149U8/dUbogBsNWwVW8VWZavbVturb+eyGUpRNwCR/WN+ tO67u7Dh2dJCPdV1gm9RN+dbuuleC7UFNvZ1Lu3Vo3W57cZX0xmkt+elrXLxrb/4rQqA1n1P8tgq nG+db1G3hzzGdoNvAdj/XevK69pYmFMyhS3HyKvUk+0vKsKh6/ehez7kpOWvrDp394okLzbMDxdO ImcH2yEH2JVNyhthfGw3hS4F1i2k7GrbcPOx6WOndBXF4H/wkqQAlmphX/UOnFh7mxzmMjTUU0oO jvHax1XjYl0EgPSRfdal2FZCjg2GDamnt7oowNamB2IAsfNSPs3/U4g42jc9A2FCqipWWgGwnnGG IwFAGi5sLcSiBkAf2nQwjJiEkBcSwA1ijFKcLvpaexwNbPC10fx1Duy6qM3LP/y+atICzXH8BJCB AFgvrtj5xs6M7IEqJeRFfXdnb26nc94DkL8ltFxWzYAj9h0BYm0WQJpLHPhYDoEJ/oPKkm6AN/p5 6ON6r2XCIQ+P5QOluXf3amY3PQF4Lb3VvDfVZmLc9z+CWF6QGna2oB2ou3uAPhTAqbaMjfRezpaV pET21iHf9zFn4zKX0qTnaBsHb8CL7CN738e86Aw29/KiS0GadJrY4Ze1S1lvAPLLHYOe4dM1PQ0X bs6JQ4pDAiD7MF5dHPy+YtkBLIZAVzN9BADVhdADgGgw36yJl5UBVEc2JZx5ti4yEOtDl2IuxTSX OCzDu8yo0HvxPUJPU06u+nOpEbtYVtVFLKZJgkHjPTEAUAWqQGx6an6+OFw1RIWmWhFPxIHAPtcD zMeGb4eoja2WKF0wEM8dLOp5TeyrLdsc2RaDZsXwQTikSRw8wLMK+5qkMEEUjjjYtNHTUfy/LBQB JCnneHFmzzYXUD33T8e8ZUMHBQBVsxmkiybAEXxHJ6l8bLqU3R/fkS5pyhgubMIKR0e2b2MXrbYB 4CUAYrfLhvEGKWf9J3kBI5l759XuB7zfGd6QeYJiF2vH7I69ZCIAaE5SGn0U6D7s7B3T9nOQYyCi M2MmEc2uWcE+1xABuMa2d86Y2s40G6iXaEQyJRv5BgJq/nEMiCNFMPtc+zji5ziLAjYY2P7qqPkT cVVF5UvUgcLg62vRnWzWHhC/R+isxhfOkFgPOG6G3uO3w/QNgPoSc+9j04F+OcW0EWArcLDPruYk xWaOOO6jIPssxc36+y1czXaLgcAEJiQpScpvKynizxjj4GvT01z2Fcz8FAAN2ROCczQ2Xhkp1wrg bUMI+qABiEEA/OcXW4xFxciprF+wCetp0bF+gHNvDcB3ZJ3aRiHDkvkGG7gcZpVh+ZvjT6t2vRev 6hiu5ntH73PTbpZmW2Ryg6Yny9DLypUCAG+DDICplqkWAKHlst5KLsGFPXjtD9GlzNNUAdnbxlH6 +eV8R474XJzadGPFYwZ9bAqACfSx68+BUF0wjpnuvfHNhPE9e44/cTyZYYLvyHfE+0Yh41hwyQtJ Cjd76zKgDr7uTDOhBzA6b8NyWTW0/LHp/JRMHN76JIDqgkkN0ytWqHFYAFTV0DDAVeV0XvMXhU+A 3JqYcO9iWbSq2GsAuhQm4xVOkuwWs0KXNIZoRWuC0d0yI0sJM1iqQ8Xt8QXg/gF9lHNIaHpKUpwL wNQYnYxu/07qDxs+rne6ki4yZVAfD6TdrTjZ5wl96GlW2M6CrwGE+566/Se+uwOfAA8E9DEvinWf yEThVq26N7dy35vKeFuMLqmPp0bFQTl6L7r9VWoILWcF8ac9sYjMZ1alhsHXpp/lRT8d3yA6Apr/ uiPtGwba0FNe9kL62a4X5zuySNtjnDu4rFoXwcHvviMTHIBijwWA39cISYoJfTvZ1ooHCUh1YVap SMGPei+i0Lsyo6rsD2QOqOyXOjqhypeqo3/71z+3HlvB3f+dr/eu/O+G4MdYv1cYqdbt+3u1Yae+ qo1CAMra7G/LBXD5UbvuOS1r6+GIy/eKcrGB3VzdKgBw69urb6/++1kBDJAPjl3bte7776ND2drr BwCH76tvH3PyV7/VtqyNb+gxl2vDW9l8+2EuiW5wLQBg26p7PAb2a3d90ncDYH5tTnPjiE31/OGf U4H1/TIXAHGkNCnoZyddVcpqihn5W0AhAvnlQsMMsclIKvCdwxs5jbdFirPk793FBatDunnUXF2o LqQMh2MbXwJg6K3VYe4IYOrR+GxcLS8AAQ620RFLuCYQ9K7niJwxNvnlTOnQx371v5XLH/4JCmnK AMpScu+9DWeIAftWN45kiyzzf5cH09smX8UGCCnBiPf9mcfb6uDnmO6972Dtx7TL8XB7Hzjsz7vC TndbaBTZ5Fjb//KQrYFm+vA46tCS+fM9Bd8DwJ7VYbFN1vkcX5dkbhhzvm+7bTy1EVE95ueetDOf dpwL73tHvrPP2FRo2iXp7p45po9iBuv8M1iDQvWc6+8PznTR/wPm3KtLB36DHwAAAABJRU5ErkJg gg== " height="37" width="75" y="-5.6843e-14" x="0" preserveAspectRatio="none"/>
  </pattern>
  <pattern id="pattern1559" width="50.999999" patternUnits="userSpaceOnUse" patternTransform="matrix(.26458 0 0 .26458 48.948 96.975)" height="26">
   <image id="image1556" xlink:href="data:image/png;base64,iVBORw0KGgoAAAANSUhEUgAAADMAAAAaCAIAAACVYPODAAAAA3NCSVQICAjb4U/gAAAF70lEQVRI iX1XQXPrvA1cEEpiRwLtXL6ZTt//673H/t72/GRCiuyEIHuARMl5nXI8E1siicUCWCD0r3/+A0C5 G4BqKozP09Ue/UCJigII/RWALQaAz2yLTd/K/dWPxJ4BtA1+ZIIAGKD6lcDRNwwvAmAu8FfYlhoA jFr4HADYUmBJjbpyt0pxYJrtdolXALB2CvweUFOlyGdOsw3zSIAwOKTaxyOmoyXizSRHYnGfp2/1 7/5KGDXIXECMagrg/LDljQGAozA63zqVyieeTM9f72cAlOaC2F8rYIvxGQD6gAqZvhXAFZhMB95p 2JY4rGo7DgDEUk2PDycIyopJMwCssLbVAaCa+gC6a7BbYeP3kO89gDSbM2+LtEgNL8JnVlObLfET W38uN+ywAAhj2oACSJmEtuBsoSSKoQ82jSGc2KkGUPjC78E+C4CeL85Tw+TBnQtssfe7CaMP64Zq Gk7sn9hzOH02qo7MNazrsqR5Jey4bBpTRjdOxYGrgVj6OwhKRetmdb80SL6jmiJIDeJw57IbS0AE bDH7Nu7ZZtUM6XBMr/a9msqaShh1T4haE4APCSF21eEDCKfPuaAGAeAsNrZ8eUpN37q8fjp/LTQ2 j/08vt/HuYBYbDZYEkqXeA2nPYHcjSfmgKsE/xwfdumhv7obGDfAZiN2aRCB8mkGwqjlKqES39II QNzK3UYDtuLfmQhAAQDNkC4CSLOlTEAEIJQcltYolGCbpljK934q1GDZUjrpkPhXNeWey/09nDjN 5sJmn6UGIcbtEwPGNSJfSV7jBHFYDnR6JhWAR8oRr2EBwonL/R1ARAWkbqe0RrwBSwEwhApgKhQA pIe7LtXU5tFh/bDUlrzGGqSawhIsqUFtj9ExTFrjj8CNU58ybea2h4ckG0Klkpy8zv0jFtd091LX ZsC4r2cmCDFSJkJFAfHqcav/iOo/x1u9DJPHrm6qUk01I75JNd00FFqj57cTnEMFoLisBGtebx+w UwVADZZ+t/r3dR3CkZgfikAsKdNlmPZizDss/JH4DssTP88/pTFIB6+dFpf9PEcJ1d/6c+d1Zf5F +oBqeoyOUGqwiCW+SbuqefLDH80rrK7nYxsIHseU6bhbeE3tUcs4Fc88YkkPdUcBTN+rPksHoZQe mh7a5L61S98cuwqO1dT7Op71bHnjrmfNsKWsXFrqjr3sIIlKLN5rvdQ956Rb+33KFLutDjgC2Ok5 NKUnbzc6W68USkIAR1gyNTPyq4YXmQp1u094uqhhrV//ATDeIphit5W6pUo/w5QyuRt+u0vuzhBD TSdbIwhAC9ls1yvGzwEAGESx1jQVgqVOM1DJJafphcegD5i+daWEJWWkx/pTuoRDq14b9pYRxOtI 0lBOts5hDZZ0ACS/WJ5tCHCl8Na0NqT4Jg0Wseh2xY+JCoBNY4vLMWoNjdb4swYt5dmO5LU09V7e 9fwRn4afNQ4cOy/plowtFY6DijAAxfUCoH79+0cQG21CWLXKzbuBfk8sW8oQ+hglZfI9rTCHUD2I DV7wK47jSjh9tsmk0aOGPmxTMketcS1VYHiRVnHNaedvbfb6e7VCa1eIXT0/zJZyfviMntrBdkfH Pf/tqx67kM3W5Fva3LxNH/6QUAHEN0mZKu2OArhNA4DrhQCkh9pShhDzbNInush3cpLGlaEgUyE+ fwDAUlJG7NbG0B1N7tmwYdc/h1aOepgyWtY3H3q6vcQrtnbcJD7PNpUbQMerlrfA238l4Bg76Jf6 ns7Sb4/mj37sW9fqs3Tk+X+u5sPyxstDURXA+es9P/7fqV1aeeuhDDWqQYKbfNLGLX+Fn6rM/x4z 8mmYtqeY2mx2749PjuPXcQ2hNlhtUdHgBkYtmjccHP+aBwDBbh4jev27hl9NEfbxOtPa1izJa/S5 fmWCI4Cu565/EgUvgh2TIz7AUiN3rNMMZP24XtJjlQ9hLHEiiAXBlhdlLrWWEeBzOD/M7a2V6/Vv AEcBNIOHqx8ZNe0KAqQMA39syuL9wF+pkXAbJSGh/hd9qTATNy8i+gAAAABJRU5ErkJggg== " height="26" width="51" y="-5.6843e-14" x="0" preserveAspectRatio="none"/>
  </pattern>
  <pattern id="pattern1575" width="73.999999" patternUnits="userSpaceOnUse" patternTransform="matrix(.26458 0 0 .26458 51.594 76.073)" height="34">
   <image id="image1572" xlink:href="data:image/png;base64,iVBORw0KGgoAAAANSUhEUgAAAEoAAAAiCAIAAAB3FdgRAAAAA3NCSVQICAjb4U/gAAAUlklEQVRY hU15z48kx5XeFxFZ1VWVGT+yqqenf1VV93CoocYcDleESFkSsdqVsLa8WF+8e7J9swEDPvhiw3+J b4YPBhY++OIFDBvGLqRdUlhpJdqcGXIpDUVOd1X1r+mZrowfmVXVVRURPmRzqEAeEonIyPcivve9 974kf/LWNoBVSyklAdhAgtUAlKAA/Cy1gZjCcBbvPDi0UQSnVa6IHMow0VoDABMsUyKJKZO6GCUp I4ynFKzNAChigtwOrT0Au51wMT0Prb3dTjib0frJ4e3k+HgMYOP2EF+N6+ej8zkBUE++mJ4DODgY HB+PDw4Gp6G90nlYTujitJ5zMbu0hc0WXnaq6XRUQXEaAZB//8fvkoxFxs3V5OK8aKeKcglA5irv 9V+Oju30BEBhAoiwkRBvZS4P7gyDHpvCTCehTAkRKpt5ADYSAQNAKWkDkcQCGL3UhMrabmvBc9GV KiPaBgJAEku5jExQrgCIBPBWwDqPbO5jPji5MixlqtuHtwCmpEfsi1wpkcT9vQzA2dVcG80TqG7f XTvA1b5FIsh/+rd/dlQYow3rUBJtlgjtgluj/l7U435OD4fDo9FIuzC488BMx59+MfZlyCWVghBL LOdHR6N+kwOggkXCtTbOkxiMaIjh4cAURvHy4ryoPXxxLZUkSsngTL1xkkQTCQAQQTnNs7K6nAJo p+rVzlJOSbDaRAB5dxCiwe8MEiwAqgbe6hp9jd0uAPLf/8M/vpxxyDymndcGG7MXi6fni3s7rafn ixLiW3c2D28n8fLz0az1/OL57e3b9XK//OxzpVQkQmxwEuz2Zju2d59/+pFZO+qi3T747jv36OjD //rXZw/feT+uXTF+cra0+73Bt9/5Qaf4xfHR2QdHDoDs9dXmP9DFJOixW8MGcn9LkGI80jBRCBoB lFFBSeJtWhYkusHhoLm9+ezTL69OfdlhgkWVS+ItAF8GACyjkQlO49mKJr+1mDrD1tRdnHzyxGsb lKDGKq01y9RPpmNfajDRV5R1KC6eB7kN4LC5ejkLkWXYwPZme/DN959Px9uv7W4DdRQdHt5dtOOf 5uuWaAC43mmdz8nBweB2d0BvJ2FIhvEvmch3e1tAcAt6sHuH57f7994HMHn6IT166qL43racHI3G 2UAO7rrps6CT3dadpF2u515uDiLTD3MCo0203UEXgNEaABW5toGx2AfIf/xXPx6NpzJXitPp5Nh5 Asp9GahUZHUqKsScA3BrIDilpJ8FrUMeq9DddYEAULkCQIhQkhRXEwDaBpYyzqIv/ayd7AlrKw5g cmV4g9ekVa6czPtKqqwaTV1wkLmSUipjdEpRBezvZTvteBr3AeyRk9+eflGYIPNBDZ9s+y6A4fDO bhrpfHT0fF3TTz1Ca48uTj958mvyb/70H/pZcGsI5zSCAo0iggmtA+tUAEQFABphXul2qmh6w6gs o8aJvW5UkhptbBSRChIspzHPKu1CJNwFQrxlGeM0ruepC+SVb77mZyU5Q2Rcm/DKuEhkQ6oYrTcF ABdI0q52G1G7YKMA0NtptJedkyvjPOnnJGvwcuUAKKUI4/baaWN4k8Pb5OpsDYBElyyv5iuGVM3P NVAA6F/7yYqFVEXCbSAi4xEAqupyCkzTbAjgdErsdEw6zjhOWJ9wQrwl2jpPYkPowpBgVaCacsAR QFtBvOXEOioAaG08i4yDxKB1EFQAcBLQmgQrwqmiEXSfLLyuLJi4ORxbTE6fOfT3uiE4d7qcAOAs Rj+ZzngkvG3iNByzjLL7IsX1Ql8LvyZN3gHQaLY28s6qmttAAaxXi3NHFquNeB0XCxvnOt3qbu1t 3+qQDfNiaooXM7jQ2qBAtGEZm6uop88TbGBhN2hzGZbzFb+e2+bqOi6vzRztDbJwi7BqmgUWyyaW 1xe2SRsE1/YauArtxeyyw85mF6MeX85M2yVYBizcYtVoEf+SAIvrKFpLnvJIJBCXESAbG+R6sQTo xmnRcpFssubLRYvUaR3AYi2oUCyjwWqW0X5Xahvc2vky1IzUSmxN1pFwpSgp3LPJ+syTdGdwa5OI cBKqG4BZD6UkT2AKU3yFuvr1Dc+vmatvHM+ZUJxFADX1AShslMTOK925xeKMR8IB2EAokRnRt/np y9j3ZSDRAVCgMec1Yom3wrmYc61v+NOXIQGwvpwlW51WYtMsoWpABAXABbhgzsrpvICk80oDWLXU ykMwd3Gi15ezy9Ds37mjcjiPoswGXQJvZ2nei8ZXiIRTjhymfrcetW+trK8UZVEkOzKUIMEF7ZSS VOQMqT8ZtwjXFRE0kuhqDwHAxFEZgNFO2gXoV4HKEW92J+acFA4kZRlFcItyyu7dzmjaEK/1Nrod 2ZELeutgcPDDN4ezdaPdVoOt/uh41Njpbm6qaYXGQoekFeb6co7pgqTD1+6/ubnyrt1cfuPO8O63 f/TuH/6zf/Rwl87XZmbLRkfwreXqZYKNRrNVX+vVop2q7uE9fc1zvkpvpa18+PY33/zON2551pjM E5mobwzS88l0bmPanZEmwfJ6m6wkXHtjtVokuxvzwFIAUUR0BC2uXizE9XKjsZqvaHndBJbXYdWc F88BJKuWilRkzVzAlmtrtMHwILY3o3s6vjKyN2jsdBGNtlljoS/nYA2SroVoAJsSchMk8+WVzNW6 8hcXlwDW5EQbHZlQKe0szNnl9KqR97f2g9Ekug3PierbNVhKWcqCMf3be7udMCSLX89CVlmkVTf4 RTlBFKGiNQI922H+hvcvF6rbREFSOJBoIuFCAkAwqFMagSPR1RUPLQqtcvngrW/+wcPtUubT0Wh6 Nr04faGkusvm1fGHVyfTyPpK0Ms5np55AJJESaIS5FB5RFfYqG3QOoaqoIvTcP600AZACk1aJQBv i2B0HisAjueRCgAkOADTkytj9NmMjmYtPTrilecN/szSdqqcJ5O1jIQbtXfmaZ2cAFDB6ptXg3gr iM1j5ctQRvXq+bzSydysWcqsnv/06nkojJIkRut8jkCe6euL88A2qZIyLc3crHdFT5+FNCdKSa2j nKfLucmzkgc3Lvj50j36aNxY6O39YWNHVZFxGutNUT2iZMQNfSDPqhTW2ejLUGhT/PKv/rbQPCFU 5o1UpRWC9SYwuJgPco6YEX1eTtupIpBAWUdjHZZKUVOYugAto9plgXlakNQG0oRO1qxnAym9O9wc HB7S//3lT46fjdzSaa2zKrZTdfj6A5ayT351BCDxV2vWS+QQpgitnKW01E72+uZqYgqjghUMKu2a KNQ8wHvj7dysG60eAGPjvNJ6zZlwDV2mjVi76k1RrpzWZiRe66/zrWjh7WTpAHW4T/s50TaWUWUZ IhChQb4+H6UoAJlLUjiNIBTONAX2EEEJlp1BIgQOhmq3t3U42Pjrv3lyOUfesu7z8dUc4nA4PDyQ Qj3+9NnoYl2vyHPx8hrraOmC5FljquE8qS6nSiqecERXkJQCilP9FV/eat5kC78WW8mk3Ris59HR 0jsNZADq1iGnq00VU6dDMHOzJiz2e1LABhICCWVUGdGvvIqEAzIC5fUZb3LLOQUiILmt62kSndYx efjOW29s3v7sy88/eeI/+WKc58qXAZl6/80B6zAAH/7sWTEd1+u2ZSJIxHXx/OW0vSl95QEImFXW X0dlgxGUl1HlKXNrZA3uxpNxRdLbZhCIrzLALtaiv9dtz0gZ1JPJuiuVinZeaZEqNDi8BQGlEkC6 M9A2BBJI4XKghLKB2E5XhMjWAFzW4AB4k89aDKUHoARlaQ/A1fmKeLBOlehCf/C3gYQV8ba3KlZM KSWHBzkAf341nh6tTbCWgPUSf+VKuXXrpPaT7m6xLEOhtTbadPQGDlo3eOMs+lI3ev2xDwCq5z5u CSCAiETkvtQlCMtUVyqhQArXb/hL62kXfh7QQXAaQDkzziuRQCPU9KgLAMgFQXCME9ZUYELx3q2U aeN9qYMeE69ic99cfTKeRJ6LJGmdFc6BiqCNSNUa/dlOd1JMOY2miHWly3MxUIDhOtq6DJiH5j5d AaAiD9q12MlBi1CpgtFCAQDLFG3Nam8bre50KbvcBKuB3K4hiF2eFgAh3kYR1/YWbYakXbklyNIU xfgqS3Y7MjIBmBsW0Q4Qd/oMQGFFTqjiVOZdodoA9vPLScEKr4oqU00AeLFE2lKUM5ELyi6eFIUu bBaiWZ8emavJ5MpWHdbbz3v7+dsPur/3oAdJJIlfo3RwV0nlKw/K063u5s6sLh3qngDRrfRxUWgA B8MBgLqJJpzkSmUNTqITClTkjCuNUCsgAKRS9YFvbmCXxZu6BJhXurff3VXwpRc0+tJfna9s5UNr 771vfZ8VV+NjbSGdJ4pTllEAZ+YyKapMF2bz7p37t/qc4ey6TpHjcGrOL6f5673hwcHVyfTseHTr enUJtVgLdAUgiX2B4UFvt+tL2tCTyzNBOe7c32RiAOCd/dbz6sX/+Z+fN1q9cmb2qU6mFyOyk7bi 2+8roc9okzFbckGcRXcvd4GYQAa5UIoej33t6tmVzUgAYKIYL8UDOqB0gjByAZyCZcpeO/vZR6OP /65a2PU8s9oDWFc+UrFafLnZOEz+5b/48cKu6p56px2Pj8encf/eu/9uN23TxYSQ0fx8+Z///L/8 t5+t7u0y0SDOEwDO2kdPRlHc+oMf/FPAbr54I5w/PXxt+HQSn9nsrd//bnP+yw/+16NxRYCpjGgl FlsdvAAAbchu9/XX9+IvPv3VqxPjwXzvMN/afPjbLx8BGKQxIzqPlY4hWO8NeTknAJjIeXNanYyw 1XWesHiaWn9SZTUDC4VaRJpOCgAvX5jkz//i54JYU2gq8n5PcoZZ2vzNX/yP+sNv7NzaIyecRAAn 4fabYkMFWxQ68eu1weOffUQ7u//8j/7wtW/9iTf/T3X77elk4/GvR6Nnn/38g8+eXA5SDLeTdkoA VbcO1fn440fNN378g2/84EdvfOeHOP7LReugtf16/bmf/vQnjx89JlSee+xnOXFuXmkwnHkJ4OiL o27v4YMf/l731z+JeuTipBjHSYDsSq21L4OgkSiatBo0o41WFwB57/XtrfZNgtrwnAo2nkZrwTMz N2sAt28d5KL8zZcv2zIZbqo6DABczgHAlTLdGRzuCBJs2emmTOZJURx9Mq/06GLdlsnhsBujiTMe rK+uno/ITroz2Lwt5d7W4cFwj3ytILji+eNHj6vL6eW6f3K9fPjabW91czYGMLpYn/veVnsw6OPt P/7Rd96425z/kh5/8FdHpKEOvC1OpiZSsTq7AtDbTT5+fPRsKjduD2/6ve2dHEwk7RJASPa1DQCC 0VobKtThPjv9/Gh9Oesf7gM4r6avbGqnSnT3R0fjWgV2axepULkUxMJb54m2obHQryYXJpwWpGbj rlQhGkrkYEBrWqIin55cXZ36qlWpXPIGj3oyr/RiLX73reHbD+/fvf29Q9rafr0On+Pj8dPzxeNP n0Uqckkf/erDZ1O5eUsm733/97s7LNCtnfYNK/729ItIRCTi3k7rfE7OQuOddPkLhkfrq7qW3Um7 UgUdiPNk+NqDQRK27m11Fp56U6av17le8U0Azz57FphB+vWZ93aT7nCPeHt0NFobU7XZ/W3hSz9r y4PBcLfXnjTOjZvuEUIqbcGBfpbxNKO5NNYjUqLXVn/04ei4/zPevTu82FWr2nJTjJWgzld2zV0p Abx1KJPCere0QHHS3JOdSmtttJYqyFycTxtorzNrX5x/GUufSwogWK8FrJc8wX5P9gc73/lmP7SH dD46Ph6fzwl6sOPfTCdGu0CKr5vRfuNqJQgYZ/ngzfv8rYdv1ymLVLOYdgCE1h4WpyxVQk0BRTzN yptj92VQgihLChLrNjwU49LbUSa3t9+N7XAxPTdagwklpZ/f9BNu5ci//ifvAZCUm+AAuKXjTf4q 2+RZBUBrTSwBkCxfvGz2AFiPg0E+6EkDSRiP3nGGbkamZdS6MNrUgrmLgicINqOidEsHIDb2ALCU vXk4zLbvVi+fcwYA9tqFSp9cjrUNtQwJQOpTjeDQz4gm0eWHDxSn8PYsOG+zbj9/Y/NGVv70479z gWStPcWp1vrnP/2/a9Yb9EliCiMFMQApHICA4Ch4AhId61DtAgBiSbJ8AWC1uaksmWCPMHh3cuQ0 mKBc+dLrjH12STiLdX2cZJSVxQYx116eedEvnAA0QmFGVCgF+eTxo+LDj2sdus7CPKn31LFO5Q1I dKbj3Ow+ABIdTanitD/YsVqpaN3h/nZnK3z1W8Y7LTKatRBWmE5W574Hjz4VSSQcjLo1PEkB5LGC cwVJAbClA+BnKUjqWOAJZ5EaCPzO2PCTa22R7JlCK0G9uwHGugzTNZm98K0sA1CQtG5nD/oMcM6T yMSgawHCOnQ9T2ss+dKQ6KyHYE4KYizPiHZrB4bqcvoJRi6K+8OUBqdPxn/vjs3LsRJU28ATIfKu ZPHoePT3Rzc2UCITltHTJfFlqHEYWQQT0IFEV13qsNnt1CUfFWWUcABQQ8VFyYkdnYd2GimvNyLA 2xqQxJJAdlctt1o7nqCMisDRlDqP6nLayrIywkJIbvks0OKsICmJjqU0VBAMkfATqwDIzKpAq8vp 6GKNiy9eTPk0vP79w61379VEuAugc6u1lW4dH4/bi/GjJzHxVzsM44qEKJPCRpaRpFNqGyIVVige Yx5PAbrZ8FMKZDQ4ACCcZA1Ogg0GMq9LRNHKssJERQKVKpJIGGomKUhaRlWDvDYkEg5UoQqrlmrV prFAEwCIIjJfATRUwUShcum+1tZuMgrwEsDxaFzOjDkd/PhH7wHYIyfncxIuNzfvD4Hx3zxbFCas WQ/AG/tQuSR/9t1vL8oJgKtGXq/FG7wOibrbr6VOKhQTKmtwAVOuXNbgdHpWi/YALOeRiVda5VdR BBcIWZ2C8shE/SsCX83xpa8nsJTVv6986W0goKJWPt3K1Wb4MuSxqnurSIUpTGSit58DGAg39sga D7o9QZcTbUywxdFJcIWV+0qw+P8BIC/9mkE/+eUAAAAASUVORK5CYII= " height="34" width="74" y="-5.6843e-14" x="0" preserveAspectRatio="none"/>
  </pattern>
 </defs>
 <metadata id="metadata5">
  <rdf:RDF>
   <cc:Work rdf:about="">
    <dc:format>image/svg+xml</dc:format>
    <dc:type rdf:resource="http://purl.org/dc/dcmitype/StillImage"/>
    <dc:title/>
   </cc:Work>
  </rdf:RDF>
 </metadata>
 <g id="layer1" stroke-width="0">
  <rect id="rect817" ry=".0000081380" height="25.4" width="17.286" stroke-miterlimit="0" y="95.957" x="81.315" fill="url(#pattern1618)"/>
  <path id="path821" d="m98.601 95.957 9.8778-4.2333v25.4l-9.8778 4.2333" fill="url(#pattern1616)"/>
  <path id="path825" d="m71.437 91.724 11.113-2.117h14.817l11.113 2.1167" fill="url(#pattern1586)"/>
  <path id="path1121" d="m81.315 95.957-9.8778-4.2333v27.517l9.8778 2.1167" fill="url(#pattern1614)"/>
  <path id="path1582" d="m71.437 91.724 9.8778 4.2333h17.286l9.8778-4.2333" fill="url(#pattern1612)"/>
 </g>
</svg>
