<?xml version="1.0" encoding="UTF-8" standalone="no"?>
<!-- Created with Inkscape (http://www.inkscape.org/) -->

<svg
   width="5mm"
   height="5mm"
   viewBox="0 0 5 5"
   version="1.1"
   id="svg5"
   inkscape:version="1.2.2 (b0a8486541, 2022-12-01)"
   sodipodi:docname="cahier_de_textes.svg"
   xmlns:inkscape="http://www.inkscape.org/namespaces/inkscape"
   xmlns:sodipodi="http://sodipodi.sourceforge.net/DTD/sodipodi-0.dtd"
   xmlns="http://www.w3.org/2000/svg"
   xmlns:svg="http://www.w3.org/2000/svg">
  <sodipodi:namedview
     id="namedview7"
     pagecolor="#ffffff"
     bordercolor="#000000"
     borderopacity="0.25"
     inkscape:showpageshadow="2"
     inkscape:pageopacity="0.0"
     inkscape:pagecheckerboard="0"
     inkscape:deskcolor="#d1d1d1"
     inkscape:document-units="mm"
     showgrid="false"
     inkscape:zoom="26.910887"
     inkscape:cx="11.277964"
     inkscape:cy="10.646249"
     inkscape:window-width="1440"
     inkscape:window-height="831"
     inkscape:window-x="0"
     inkscape:window-y="0"
     inkscape:window-maximized="1"
     inkscape:current-layer="layer1" />
  <defs
     id="defs2" />
  <g
     inkscape:label="Calque 1"
     inkscape:groupmode="layer"
     id="layer1">
    <rect
       style="fill:#44ffff;fill-opacity:1;stroke:#000000;stroke-width:0.0981168;stroke-linecap:square;stroke-dasharray:none;paint-order:markers stroke fill"
       id="rect1838"
       width="4.9018836"
       height="4.9018831"
       x="0.049058393"
       y="0.049058393" />
    <text
       xml:space="preserve"
       style="font-weight:bold;font-size:1.24053px;font-family:sans-serif;-inkscape-font-specification:'sans-serif Bold';fill:#000000;fill-opacity:1;stroke:#000000;stroke-width:0.0390718;stroke-linecap:square;stroke-dasharray:none;paint-order:markers stroke fill"
       x="2.4956517"
       y="1.4293383"
       id="text398"><tspan
         sodipodi:role="line"
         id="tspan396"
         style="text-align:center;text-anchor:middle;fill:#000000;fill-opacity:1;stroke-width:0.0390718;stroke-dasharray:none"
         x="2.4956517"
         y="1.4293383">CAHIER</tspan><tspan
         sodipodi:role="line"
         style="text-align:center;text-anchor:middle;fill:#000000;fill-opacity:1;stroke-width:0.0390718;stroke-dasharray:none"
         x="2.4956517"
         y="2.9800007"
         id="tspan1056">DE</tspan><tspan
         sodipodi:role="line"
         style="text-align:center;text-anchor:middle;fill:#000000;fill-opacity:1;stroke-width:0.0390718;stroke-dasharray:none"
         x="2.4956517"
         y="4.5306635"
         id="tspan1058">TEXTES</tspan></text>
  </g>
</svg>
