<?xml version="1.0" encoding="UTF-8" standalone="no"?>
<svg
   xmlns:dc="http://purl.org/dc/elements/1.1/"
   xmlns:cc="http://creativecommons.org/ns#"
   xmlns:rdf="http://www.w3.org/1999/02/22-rdf-syntax-ns#"
   xmlns:svg="http://www.w3.org/2000/svg"
   xmlns="http://www.w3.org/2000/svg"
   xmlns:sodipodi="http://sodipodi.sourceforge.net/DTD/sodipodi-0.dtd"
   xmlns:inkscape="http://www.inkscape.org/namespaces/inkscape"
   width="247.16751"
   height="458.70963"
   viewBox="0 0 247.16751 458.70963"
   version="1.1"
   id="svg483"
   sodipodi:docname="perso05.svg"
   style="fill:none"
   inkscape:version="0.92.5 (2060ec1f9f, 2020-04-08)">
  <metadata
     id="metadata489">
    <rdf:RDF>
      <cc:Work
         rdf:about="">
        <dc:format>image/svg+xml</dc:format>
        <dc:type
           rdf:resource="http://purl.org/dc/dcmitype/StillImage" />
        <dc:title></dc:title>
      </cc:Work>
    </rdf:RDF>
  </metadata>
  <defs
     id="defs487" />
  <sodipodi:namedview
     pagecolor="#ffffff"
     bordercolor="#666666"
     borderopacity="1"
     objecttolerance="10"
     gridtolerance="10"
     guidetolerance="10"
     inkscape:pageopacity="0"
     inkscape:pageshadow="2"
     inkscape:window-width="1878"
     inkscape:window-height="1031"
     id="namedview485"
     showgrid="false"
     fit-margin-top="0"
     fit-margin-left="0"
     fit-margin-right="0"
     fit-margin-bottom="0"
     inkscape:zoom="2.8046588"
     inkscape:cx="-19.376826"
     inkscape:cy="10.604457"
     inkscape:window-x="42"
     inkscape:window-y="25"
     inkscape:window-maximized="1"
     inkscape:current-layer="svg483" />
  <path
     d="m 48.365236,117.518 c -14.8576,43.424 -17.0501,44.767 -32.0303,86.863 -14.9730001,42.094 -33.3647,74.861 14.5113,132.852 30.7534,37.253 34.2444,-201.335 33.3864,-215.374 -0.858,-14.041 -12.8598,-13.119 -15.8674,-4.341 z"
     id="path407"
     inkscape:connector-curvature="0"
     style="clip-rule:evenodd;fill:#6b85d9;fill-rule:evenodd" />
  <path
     d="m 39.616536,419.161 c -0.7862,-0.807 -5.9213,4.299 -6.6065,4.847 -3.6928,2.978 -20.4617,18.419 -13.7614,23.461 17.8796,13.443 46.318,11.878 66.679,9.938 14.129004,-1.341 27.537004,-8.871 16.120004,-23.612"
     id="path411"
     inkscape:connector-curvature="0"
     style="clip-rule:evenodd;fill:#f5c23f;fill-rule:evenodd" />
  <path
     d="m 192.15264,419.183 c 0.779,-0.801 5.921,4.306 6.599,4.854 3.693,2.978 20.469,18.419 13.769,23.461 -17.88,13.443 -46.326,11.878 -66.687,9.938 -14.129,-1.342 -27.537,-8.871 -16.119,-23.612"
     id="path413"
     inkscape:connector-curvature="0"
     style="clip-rule:evenodd;fill:#f5c23f;fill-rule:evenodd" />
  <path
     d="m 92.121636,4.6124583 c 11.699004,-3.89452598 24.681004,-7.39815 48.583004,-1.35515 16.019,4.04886 30.545,15.1503897 39.842,42.6334897 19.899,58.814202 39.488,230.352202 36.379,290.063202 -4.688,90.03 -33.105,103.077 -101.919,101.194 -26.469004,-0.721 -87.075104,3.679 -93.385904,-70.122 -3.563,-41.622 -1.6084,-83.529 7.7244,-128.528 7.9337,-38.284 12.9824,-76.07 14.4249,-99.159 1.6372,-26.37 8.0276,-78.443402 9.7225,-93.884502 2.6971,-24.6863 21.5361,-35.1553 38.6291,-40.8420397 z"
     id="path415"
     inkscape:connector-curvature="0"
     style="clip-rule:evenodd;fill:#6b85d9;fill-rule:evenodd" />
  <path
     d="m 100.37364,65.820698 c 0.447,0.3281 0.743,0.8582 0.743,1.4568 0,0.8431 -0.44,1.2974 -0.909,1.5679 -0.209004,0.1183 -1.104004,0.6145 -2.085004,-0.1983 -0.252,-0.2048 -1.543,-1.653 -2.711,-2.5884 -1.695,-1.3537 -3.585,-1.2687 -5.72,-1.022 v 7e-4 c -0.137,0.0152 -0.245,0.1263 -0.36,0.2308 -0.303,0.2625 -0.57,0.6181 -0.816,1.0025 -0.742,1.1662 -1.327,2.9504 -1.464,3.4026 -0.014,0.6636 -0.389,1.2961 -1.031,1.6004 -0.793,0.3772 -1.435,0.1882 -1.955,-0.2553 -0.165,-0.1421 -0.779,-0.6996 -0.613,-1.7929 0.123,-0.7594 1.125,-3.8982 2.691,-5.8195 0.901,-1.1099 2.005,-1.821 3.137,-1.9515 3.152,-0.3642 5.885,-0.2099 8.381,1.7885 1.067,0.8554 2.445004,2.2986 2.712004,2.5777 z m -14.202004,2.279 c -0.468,-0.308 -1.031,-0.401 -1.702,-0.0823 0.57,-0.269 1.205,-0.217 1.702,0.0823 z m 12.81,-2.5957 c -0.375,0.0621 -0.671,0.2344 -0.909,0.4638 0.245,-0.2344 0.563,-0.3996 0.909,-0.4638 z m -1.14,0.7328 c -0.187,0.2517 -0.332,0.5856 -0.332,1.0407 0,-0.3873 0.123,-0.7465 0.332,-1.0407 z"
     id="path417"
     inkscape:connector-curvature="0"
     style="clip-rule:evenodd;fill:#21305e;fill-rule:evenodd" />
  <path
     d="m 150.83064,67.358298 c 0.043,0.9945 -0.722,1.8398 -1.717,1.8874 -0.995,0.0476 -1.839,-0.7205 -1.882,-1.7151 -0.109,-2.1968 -1.984,-3.9846 -3.946,-4.6229 -1.016,-0.3303 -2.084,-0.3664 -2.899,0.2063 -0.555,0.3858 -0.952,1.0356 -1.205,1.9443 -0.259,0.9607 -1.247,1.5283 -2.214,1.2672 -0.959,-0.2603 -1.521,-1.252 -1.262,-2.2126 0.512,-1.8853 1.464,-3.1532 2.611,-3.953 1.724,-1.2066 3.945,-1.3761 6.08,-0.6815 3.289,1.0688 6.261,4.2032 6.434,7.8799 z"
     id="path419"
     inkscape:connector-curvature="0"
     style="clip-rule:evenodd;fill:#21305e;fill-rule:evenodd" />
  <path
     d="m 121.02964,138.828 c 22.214,4.109 48.619,-19.479 64.4,17.976 8.186,19.419 12.535,42.577 21.723,114.646 5.006,39.24 11.699,81.684 1.082,123.276 -11.273,44.146 -43.996,43.865 -93.17,44.168 -55.384004,0.339 -95.845704,-15.11 -94.381604,-85.349 1.3343,-63.582 9.8089,-102.157 16.7833,-132.535 10.3859,-45.227 21.9833,-73.574 30.0903,-79.791 16.855,-12.927 23.52,-7.931 53.473004,-2.391 z"
     id="path421"
     inkscape:connector-curvature="0"
     style="clip-rule:evenodd;fill:#edf0fa;fill-rule:evenodd" />
  <path
     d="m 121.28864,137.41 c 8.728,1.614 18.111,-1.177 27.227,-2.689 7.234,-1.202 14.31,-1.62 20.808,1.131 6.506,2.756 12.506,8.684 17.44,20.392 8.207,19.484 12.6,42.714 21.817,115.024 5.027,39.41 11.713,82.041 1.046,123.815 -6.938,27.18 -21.81,37.926 -43.484,42.26 -14.165,2.827 -31.287,2.871 -51.063,2.993 -33.726004,0.209 -61.955204,-5.495 -78.853904,-25.372 -11.2875,-13.27 -17.5767,-32.897 -16.9853,-61.449 1.3343,-63.723 9.8306,-102.382 16.8194,-132.828 7.3062,-31.817 15.2255,-55.317 22.1058,-68.699 3.066,-5.963 5.972,-9.964 8.511,-11.913 10.523,-8.068 17.238,-9.4 27.645,-7.95 6.686004,0.932 14.959004,3.064 26.967004,5.285 z m -0.519,2.836 c -11.958,-2.211 -20.188,-4.336 -26.845004,-5.264 -9.607,-1.338 -15.78,-0.062 -25.488,7.382 -3.13,2.402 -6.744,8.264 -10.66,17.182 -6.0658,13.79 -12.7012,34.764 -18.9039,61.787 -6.9599,30.311 -15.4203,68.8 -16.7473,132.242 -0.577,27.638 5.3733,46.673 16.3001,59.521 16.401,19.292 43.8951,24.557 76.632104,24.355 19.567,-0.122 36.509,-0.137 50.516,-2.935 20.577,-4.118 34.677,-14.345 41.262,-40.147 10.573,-41.41 3.866,-83.669 -1.118,-122.736 -9.153,-71.828 -13.466,-94.915 -21.616,-114.269 -4.536,-10.764 -9.924,-16.322 -15.903,-18.856 -6.001,-2.538 -12.528,-2.05 -19.214,-0.942 -9.441,1.568 -19.171,4.353 -28.215,2.68 z"
     id="path423"
     inkscape:connector-curvature="0"
     style="clip-rule:evenodd;fill:#6b85d9;fill-rule:evenodd" />
  <path
     d="m 44.355336,147.65 c 0,-0.797 0.642,-1.446 1.4425,-1.45 0.7934,-0.004 1.4425,0.639 1.4425,1.435 0.0866,16.697 -10.7465,61.479 -12.2467,69.89 -1.4929,8.362 -12.7083,55.164 -14.4753,94.378 -0.0361,0.795 -0.714,1.412 -1.5073,1.376 -0.7934,-0.036 -1.4138,-0.711 -1.3777,-1.506 1.7815,-39.369 13.0257,-86.359 14.5187,-94.755 1.493,-8.348 12.2899,-52.794 12.2033,-69.368 z"
     id="path425"
     inkscape:connector-curvature="0"
     style="clip-rule:evenodd;fill:#3f5ab2;fill-rule:evenodd" />
  <path
     d="m 101.96664,89.702798 c -2.856004,2.6988 -3.231004,5.1004 8.67,12.533202 11.893,7.433 11.929,12.95 18.809,5.024 6.881,-7.924702 12.096,-17.689902 8.872,-20.003502 -3.231,-2.3122 -15.254,-17.4994 -36.351,2.4463 z"
     id="path427"
     inkscape:connector-curvature="0"
     style="clip-rule:evenodd;fill:#f5c23f;fill-rule:evenodd" />
  <path
     d="m 105.40764,93.200598 c -2.676,-2.9693 -7.523004,-0.7393 4.37,6.6935 11.901,7.432902 13.596,11.510902 20.477,3.585902 6.88,-7.926102 9.109,-13.994402 8.171,-14.488402 -3.556,-1.8852 -5.388,12.963402 -14.237,13.190402 -4.688,0.119 -14.519,-4.248102 -18.781,-8.981402 z"
     id="path429"
     inkscape:connector-curvature="0"
     style="clip-rule:evenodd;fill:#dd8f46;fill-rule:evenodd" />
  <path
     d="m 155.98864,206.817 c -1.291,0.615 -1.947,2.065 -1.565,3.439 4.89,17.57 32.16,115.337 38.601,137.142 0.461,1.493 1.983,2.385 3.512,2.055 6.506,-1.377 15.276,-3.419 19.229,-5.444 0.843,-0.603 1.226,-1.671 0.952,-2.674 -4.039,-14.764 -32.579,-118.327 -38.45,-138.481 -0.454,-1.45 -1.94,-2.315 -3.426,-1.989 -7.753,1.688 -13.92,3.684 -18.853,5.952 z"
     id="path431"
     inkscape:connector-curvature="0"
     style="clip-rule:evenodd;fill:#dd8f46;fill-rule:evenodd" />
  <mask
     id="mask0_540_5537"
     maskUnits="userSpaceOnUse"
     x="199"
     y="200"
     width="63"
     height="150">
    <path
       d="m 201.056,206.817 c -1.291,0.615 -1.947,2.064 -1.565,3.439 4.89,17.57 32.16,115.336 38.601,137.142 0.461,1.493 1.983,2.385 3.512,2.055 6.506,-1.378 15.276,-3.419 19.229,-5.444 0.844,-0.603 1.226,-1.672 0.952,-2.674 -4.039,-14.765 -32.579,-118.327 -38.45,-138.481 -0.454,-1.45 -1.94,-2.315 -3.426,-1.989 -7.753,1.688 -13.92,3.683 -18.853,5.952 z"
       id="path433"
       inkscape:connector-curvature="0"
       style="fill:#ffffff" />
  </mask>
  <g
     mask="url(#mask0_540_5537)"
     id="g471"
     transform="translate(-45.068364,-1.676147e-6)">
    <mask
       id="mask1_540_5537"
       maskUnits="userSpaceOnUse"
       x="199"
       y="200"
       width="67"
       height="163">
      <path
         d="m 201.055,206.817 c -1.291,0.615 -1.947,2.064 -1.565,3.439 4.89,17.57 35.687,128.04 42.128,149.846 0.461,1.493 1.983,2.385 3.512,2.055 7.508,-1.59 18.024,-4.063 20.685,-6.374 0,0 -36.155,-131.217 -42.481,-152.929 -0.454,-1.45 -1.94,-2.316 -3.426,-1.99 -7.753,1.689 -13.92,3.684 -18.853,5.953 z"
         id="path436"
         inkscape:connector-curvature="0"
         style="fill:#ffffff" />
    </mask>
    <g
       mask="url(#mask1_540_5537)"
       id="g469">
      <path
         d="m 227.353,212.288 c 0.533,-0.165 1.096,0.134 1.262,0.666 0.166,0.532 -0.137,1.099 -0.664,1.263 l -6.909,2.137 c -0.534,0.165 -1.104,-0.133 -1.263,-0.666 -0.165,-0.533 0.13,-1.098 0.664,-1.263 z"
         id="path439"
         inkscape:connector-curvature="0"
         style="clip-rule:evenodd;fill:#fcf4ed;fill-rule:evenodd" />
      <path
         d="m 225.254,205.741 c 0.534,-0.165 1.104,0.134 1.27,0.667 0.158,0.532 -0.137,1.097 -0.671,1.263 l -6.91,2.137 c -0.533,0.164 -1.096,-0.135 -1.262,-0.667 -0.166,-0.532 0.137,-1.098 0.664,-1.263 z"
         id="path441"
         inkscape:connector-curvature="0"
         style="clip-rule:evenodd;fill:#fcf4ed;fill-rule:evenodd" />
      <path
         d="m 229.474,219.302 c 0.533,-0.165 1.096,0.134 1.262,0.666 0.166,0.532 -0.13,1.098 -0.664,1.263 l -6.909,2.14 c -0.534,0.164 -1.097,-0.135 -1.262,-0.667 -0.166,-0.532 0.13,-1.098 0.663,-1.263 z"
         id="path443"
         inkscape:connector-curvature="0"
         style="clip-rule:evenodd;fill:#fcf4ed;fill-rule:evenodd" />
      <path
         d="m 235.171,239.607 c 0.526,-0.165 1.096,0.133 1.262,0.666 0.166,0.532 -0.137,1.098 -0.664,1.263 l -6.916,2.139 c -0.527,0.165 -1.097,-0.134 -1.263,-0.666 -0.166,-0.532 0.137,-1.098 0.671,-1.263 z"
         id="path445"
         inkscape:connector-curvature="0"
         style="clip-rule:evenodd;fill:#fcf4ed;fill-rule:evenodd" />
      <path
         d="m 231.602,226.308 c 0.527,-0.164 1.097,0.134 1.262,0.666 0.159,0.533 -0.137,1.099 -0.67,1.263 l -6.91,2.137 c -0.533,0.165 -1.096,-0.133 -1.262,-0.666 -0.166,-0.533 0.137,-1.099 0.664,-1.263 z"
         id="path447"
         inkscape:connector-curvature="0"
         style="clip-rule:evenodd;fill:#fcf4ed;fill-rule:evenodd" />
      <path
         d="m 237.292,246.613 c 0.534,-0.165 1.096,0.133 1.262,0.666 0.166,0.533 -0.13,1.098 -0.663,1.263 l -6.91,2.137 c -0.534,0.164 -1.103,-0.134 -1.262,-0.666 -0.166,-0.533 0.13,-1.099 0.663,-1.263 z"
         id="path449"
         inkscape:connector-curvature="0"
         style="clip-rule:evenodd;fill:#fcf4ed;fill-rule:evenodd" />
      <path
         d="m 233.471,233.158 c 0.533,-0.164 1.096,0.134 1.262,0.666 0.166,0.533 -0.137,1.099 -0.664,1.263 l -6.916,2.137 c -0.527,0.165 -1.097,-0.133 -1.263,-0.665 -0.158,-0.533 0.138,-1.099 0.671,-1.264 z"
         id="path451"
         inkscape:connector-curvature="0"
         style="clip-rule:evenodd;fill:#fcf4ed;fill-rule:evenodd" />
      <path
         d="m 239.31,253.938 c 0.267,-0.084 0.555,0.067 0.642,0.338 0.079,0.27 -0.072,0.558 -0.339,0.642 l -6.91,2.137 c -0.274,0.083 -0.562,-0.068 -0.642,-0.339 -0.086,-0.27 0.065,-0.558 0.339,-0.641 z"
         id="path453"
         inkscape:connector-curvature="0"
         style="clip-rule:evenodd;fill:#fcf4ed;fill-rule:evenodd" />
      <path
         d="m 258,322.744 c 0.526,-0.165 1.096,0.133 1.262,0.666 0.166,0.532 -0.137,1.098 -0.671,1.263 l -6.909,2.137 c -0.527,0.164 -1.097,-0.134 -1.263,-0.667 -0.165,-0.532 0.138,-1.098 0.671,-1.262 z"
         id="path455"
         inkscape:connector-curvature="0"
         style="clip-rule:evenodd;fill:#fcf4ed;fill-rule:evenodd" />
      <path
         d="m 252.062,303.003 c 0.274,-0.083 0.562,0.069 0.649,0.339 0.079,0.27 -0.072,0.558 -0.346,0.642 l -6.903,2.136 c -0.274,0.084 -0.562,-0.067 -0.642,-0.338 -0.086,-0.27 0.065,-0.558 0.332,-0.641 z"
         id="path457"
         inkscape:connector-curvature="0"
         style="clip-rule:evenodd;fill:#fcf4ed;fill-rule:evenodd" />
      <path
         d="m 260.119,329.76 c 0.534,-0.165 1.096,0.134 1.262,0.666 0.166,0.532 -0.137,1.099 -0.663,1.263 l -6.917,2.138 c -0.526,0.164 -1.096,-0.135 -1.262,-0.667 -0.159,-0.532 0.137,-1.098 0.671,-1.263 z"
         id="path459"
         inkscape:connector-curvature="0"
         style="clip-rule:evenodd;fill:#fcf4ed;fill-rule:evenodd" />
      <path
         d="m 254.039,309.546 c 0.534,-0.166 1.104,0.133 1.262,0.665 0.166,0.533 -0.13,1.099 -0.663,1.264 l -6.91,2.137 c -0.534,0.164 -1.096,-0.134 -1.262,-0.667 -0.166,-0.532 0.13,-1.098 0.664,-1.263 z"
         id="path461"
         inkscape:connector-curvature="0"
         style="clip-rule:evenodd;fill:#fcf4ed;fill-rule:evenodd" />
      <path
         d="m 262.239,336.764 c 0.534,-0.165 1.097,0.133 1.262,0.666 0.166,0.532 -0.13,1.098 -0.663,1.263 l -6.91,2.137 c -0.533,0.164 -1.103,-0.134 -1.262,-0.666 -0.166,-0.533 0.13,-1.099 0.664,-1.263 z"
         id="path463"
         inkscape:connector-curvature="0"
         style="clip-rule:evenodd;fill:#fcf4ed;fill-rule:evenodd" />
      <path
         d="m 256.165,316.549 c 0.526,-0.164 1.096,0.134 1.262,0.667 0.166,0.532 -0.137,1.098 -0.671,1.262 l -6.909,2.137 c -0.534,0.165 -1.097,-0.133 -1.262,-0.666 -0.166,-0.532 0.137,-1.098 0.663,-1.263 z"
         id="path465"
         inkscape:connector-curvature="0"
         style="clip-rule:evenodd;fill:#fcf4ed;fill-rule:evenodd" />
      <path
         d="m 264.26,344.089 c 0.267,-0.084 0.555,0.067 0.642,0.338 0.079,0.27 -0.072,0.558 -0.339,0.642 l -6.91,2.139 c -0.274,0.083 -0.562,-0.068 -0.641,-0.338 -0.087,-0.271 0.065,-0.559 0.339,-0.642 z"
         id="path467"
         inkscape:connector-curvature="0"
         style="clip-rule:evenodd;fill:#fcf4ed;fill-rule:evenodd" />
    </g>
  </g>
  <path
     d="m 144.70764,248.522 c 14.807,17.271 44.688,48.695 59.062,64.898 1.45,1.688 3.816,2.258 5.879,1.411 2.675,-1.056 3.808,-2.79 4.053,-5.275 0.195,-2.006 -1.075,-3.154 -1.457,-3.577 -6.275,-6.954 -43.801,-47.897 -59.928,-64.112 -0.664,-0.669 -7.465,-4.046 -11.28,-5.917 -0.418,-0.219 -0.923,-0.154 -1.27,0.164 -0.339,0.318 -0.447,0.816 -0.259,1.245 1.442,3.605 3.996,9.76 5.2,11.163 z"
     id="path473"
     inkscape:connector-curvature="0"
     style="clip-rule:evenodd;fill:#7d46b5;fill-rule:evenodd" />
  <path
     d="m 148.11964,249.277 c -0.498,0.255 -1.104,0.059 -1.357,-0.438 -0.259,-0.495 -0.057,-1.104 0.433,-1.358 1.5,-0.768 3.224,-1.827 4.14,-3.648 0.245,-0.499 0.851,-0.7 1.356,-0.45 0.498,0.25 0.693,0.857 0.447,1.356 -1.125,2.235 -3.18,3.596 -5.019,4.538 z"
     id="path475"
     inkscape:connector-curvature="0"
     style="clip-rule:evenodd;fill:#bb92e5;fill-rule:evenodd" />
  <path
     d="m 196.88264,130.041 c -0.051,-0.336 -1.659,-13.852 -1.522,-13.423 5.857,18.276 23.26,24.386 43.765,80.705 13.833,38.02 8.352,61.414 -5.323,78.258 -8.02,9.878 -57.75,50.332 -71.417,25.524 -9.369,-16.989 -4.688,-25.988 0.108,-32.613 l 6.181,6.687 c 0,0 33.242,-36.853 37.447,-60.24 0.678,-3.801 -6.181,-62.92 -9.239,-84.898 z"
     id="path477"
     inkscape:connector-curvature="0"
     style="clip-rule:evenodd;fill:#6b85d9;fill-rule:evenodd" />
  <path
     d="m 201.75064,170.566 c -0.216,-0.767 0.231,-1.563 1.003,-1.778 0.765,-0.214 1.558,0.234 1.774,1.001 7.595,27.134 6.859,36.452 -1.161,55.251 -0.31,0.732 -1.161,1.073 -1.89,0.761 -0.735,-0.312 -1.074,-1.16 -0.764,-1.893 7.746,-18.149 8.366,-27.146 1.038,-53.342 z"
     id="path479"
     inkscape:connector-curvature="0"
     style="clip-rule:evenodd;fill:#3f5ab2;fill-rule:evenodd" />
  <path
     d="m 193.86064,122.883 c -0.079,-0.793 0.498,-1.5 1.291,-1.58 0.794,-0.079 1.5,0.5 1.58,1.292 0.36,3.594 1.377,8.093 2.192,14.285 0.108,0.789 -0.454,1.514 -1.24,1.618 -0.794,0.103 -1.515,-0.453 -1.616,-1.242 -0.822,-6.23 -1.846,-10.757 -2.207,-14.373 z"
     id="path481"
     inkscape:connector-curvature="0"
     style="clip-rule:evenodd;fill:#3f5ab2;fill-rule:evenodd" />
</svg>
