<?xml version="1.0" encoding="UTF-8" standalone="no"?>
<!-- Uploaded to: SVG Repo, www.svgrepo.com, Generator: SVG Repo Mixer Tools -->

<svg
   xmlns:dc="http://purl.org/dc/elements/1.1/"
   xmlns:cc="http://creativecommons.org/ns#"
   xmlns:rdf="http://www.w3.org/1999/02/22-rdf-syntax-ns#"
   xmlns:svg="http://www.w3.org/2000/svg"
   xmlns="http://www.w3.org/2000/svg"
   xmlns:xlink="http://www.w3.org/1999/xlink"
   xmlns:sodipodi="http://sodipodi.sourceforge.net/DTD/sodipodi-0.dtd"
   xmlns:inkscape="http://www.inkscape.org/namespaces/inkscape"
   width="209.07399"
   height="209.07399"
   viewBox="0 0 6.2722197 6.2722198"
   role="img"
   aria-labelledby="stickerIconTitle"
   version="1.1"
   id="svg7"
   sodipodi:docname="aa_cursive.svg"
   style="color:#000000;fill:none;stroke:#000000;stroke-width:1;stroke-linecap:square;stroke-linejoin:miter"
   inkscape:version="0.92.5 (2060ec1f9f, 2020-04-08)">
  <metadata
     id="metadata13">
    <rdf:RDF>
      <cc:Work
         rdf:about="">
        <dc:format>image/svg+xml</dc:format>
        <dc:type
           rdf:resource="http://purl.org/dc/dcmitype/StillImage" />
        <dc:title>Sticker</dc:title>
      </cc:Work>
    </rdf:RDF>
  </metadata>
  <defs
     id="defs11">
    <clipPath
       clipPathUnits="userSpaceOnUse"
       id="clipPath839">
      <circle
         style="opacity:1;vector-effect:none;fill:#00ff00;fill-opacity:1;stroke:#8affbc;stroke-width:0.2798903;stroke-linecap:butt;stroke-linejoin:miter;stroke-miterlimit:4;stroke-dasharray:none;stroke-dashoffset:0;stroke-opacity:1"
         id="circle841"
         cx="39.391701"
         cy="89.665604"
         r="40.675484" />
    </clipPath>
    <clipPath
       clipPathUnits="userSpaceOnUse"
       id="clipPath854">
      <g
         style="stroke:#000000;stroke-width:1.47348344;stroke-miterlimit:4;stroke-dasharray:none;stroke-opacity:1"
         id="use856"
         inkscape:label="Clip">
        <circle
           style="opacity:1;vector-effect:none;fill:#ffffff;fill-opacity:1;stroke:#000000;stroke-width:1.47348344;stroke-linecap:butt;stroke-linejoin:miter;stroke-miterlimit:4;stroke-dasharray:none;stroke-dashoffset:0;stroke-opacity:1"
           id="circle860"
           cx="36.297619"
           cy="46.060329"
           r="20.436979" />
        <image
           y="48.044842"
           x="-1.5084863"
           id="image862"
           xlink:href="data:image/png;base64,iVBORw0KGgoAAAANSUhEUgAAAZEAAAGLCAIAAACJDjj9AAAAA3NCSVQICAjb4U/gAAAIsUlEQVR4 nO3csYpUdx/H4f/JzuCApBCTwlbsBSE3YGdSbCobwdZL2NtImVR7Cza5kS1SCGGtRDadq7CyxXkv YJrJRt5zPsPz3MD8znyHDzsDOs3zPAouzsbl+Ti9WvoO7sqCdStZ8LuFXx/g39AsoESzgBLNAko0 CyjRLKBEs4ASzQJKNAso0SygRLOAks2Dl9dL33CQ1+92z8f20avPN7eNfyB5uN12Or6H2mfBupUs uHn6+GTBlz/cw4/T+DCePTn58vXYPhz3703H91D7LFi3kgUn/68D/x8WrFvJgn7PAko0CyjRLKBE s4ASzQJKNAso0SygRLOAEs0CSjQLKNEsoESzgBLNAko0CyjRLKBEs4ASzQJKNAso0SygRLOAEs0C SjQLKNEsoESzgBLNAko0CyjZ/P3H0icc5tNfY4xRuZZ9FqxbyYLT2x/nhU840DzGtPQN/BcWrFvH gr4bAiWaBZRM89z4bnhxNi7Px+nV0ndwVxasW8mC/s4CSjQLKNEsoESzgBLNAko0CyjRLKBEs4AS zQJKNAso0SygRLOAEs0CSjQLKNEsoESzgBLNAko0CyjRLKBEs4ASzQJKNAso0SygRLOAEs0CSjQL KNEsoESzgJLN9Mv10jcc5M373YuxrVzLPgvWrWTBaZ7nZS840MXZuDwfp1dL38FdWbBuJQv6bgiU aBZQollAiWYBJZoFlGgWUKJZQIlmASWaBZRoFlCiWUCJZgElmgWUaBZQollAiWYBJZoFlGgWUKJZ QIlmASWaBZRoFlCiWUCJZgElmgWUaBZQollAyebBy+ulbzjI63e752P76NXnm9t56Vu+sd12Or6H 2mfBupUsuHn6+GTBlz/cw4/T+DCePTn58vXYPhz3703H91D7LFi3kgWneW681xdn4/J8nF4tfQd3 ZcG6lSzo9yygRLOAEs0CSjQLKNEsoESzgBLNAko0CyjRLKBEs4ASzQJKNAso0SygRLOAEs0CSjQL KNEsoESzgBLNAko0CyjRLKBEs4ASzQJKNAso0SygRLOAks1vb2+XvuEgP1yefD+++/3P25vGvf/C bjuO76H2WbBuJQtO4+dPS77+wd683734Z/vrT9dLH8IdWbBuJQtO8zwve8GBLs7G5fk4vVr6Du7K gnUrWdDvWUCJZgElmgWUaBZQollAiWYBJZoFlGgWUKJZQIlmASWaBZRoFlCiWUCJZgElmgWUaBZQ ollAiWYBJZoFlGgWUKJZQIlmASWaBZRoFlCiWUCJZgElmgWUbB68vF76hoO8frd7PraPXn2+uZ2X vuUb222n43uofRasW8mCm6ePTxZ8+cM9/DiND+PZk5MvX4/tw3H/3nR8D7XPgnUrWXCa58Z7fXE2 Ls/H6dXSd3BXFqxbyYJ+zwJKNAso0SygRLOAEs0CSjQLKNEsoESzgBLNAko0CyjRLKBEs4ASzQJK NAso0SygRLOAEs0CSjQLKNEsoESzgBLNAko0CyjRLKBEs4ASzQJKNAso2fz9x9InHObTX2OMUbmW fRasW8mC09sf54VPONA8xrT0DfwXFqxbx4K+GwIlmgWUTPPc+G54cTYuz8fp1dJ3cFcWrFvJgv7O Ako0CyjRLKBEs4ASzQJKNAso0SygRLOAEs0CSjQLKNEsoESzgBLNAko0CyjRLKBEs4ASzQJKNAso 0SygRLOAEs0CSjQLKNEsoESzgBLNAko0CyjRLKBEs4CSzfTL9dI3HOTN+92Lsa1cyz4L1q1kwWme 52UvONDF2bg8H6dXS9/BXVmwbiUL+m4IlGgWUKJZQIlmASWaBZRoFlCiWUCJZgElmgWUaBZQollA iWYBJZoFlGgWUKJZQIlmASWaBZRoFlCiWUCJZgElmgWUaBZQollAiWYBJZoFlGgWUKJZQMnmwcvr pW84yOt3u+dj++jV55vbeelbvrHddjq+h9pnwbqVLLh5+vhkwZc/3MOP0/gwnj05+fL12D4c9+9N x/dQ+yxYt5IFp3luvNcXZ+PyfJxeLX0Hd2XBupUs6PcsoESzgBLNAko0CyjRLKBEs4ASzQJKNAso 0SygRLOAEs0CSjQLKNEsoESzgBLNAko0CyjRLKBEs4ASzQJKNAso0SygRLOAEs0CSjQLKNEsoESz gJLNb29vl77hID9cnnw/vvv9z9ubxr3/wm47ju+h9lmwbiULTuPnT0u+/sHevN+9+Gf760/XSx/C HVmwbiULTvM8L3vBgS7OxuX5OL1a+g7uyoJ1K1nQ71lAiWYBJZoFlGgWUKJZQIlmASWaBZRoFlCi WUCJZgElmgWUaBZQollAiWYBJZoFlGgWUKJZQIlmASWaBZRoFlCiWUCJZgElmgWUaBZQollAiWYB JZoFlGwevLxe+oaDvH63ez62j159vrmdl77lG9ttp+N7qH0WrFvJgpunj08WfPnDPfw4jQ/j2ZOT L1+P7cNx/950fA+1z4J1K1lwmufGe31xNi7Px+nV0ndwVxasW8mCfs8CSjQLKNEsoESzgBLNAko0 CyjRLKBEs4ASzQJKNAso0SygRLOAEs0CSjQLKNEsoESzgBLNAko0CyjRLKBEs4ASzQJKNAso0Syg RLOAEs0CSjQLKNn8/cfSJxzm019jjFG5ln0WrFvJgtPbH+eFTzjQPMa09A38FxasW8eCvhsCJZoF lEzz3PhueHE2Ls/H6dXSd3BXFqxbyYL+zgJKNAso0SygRLOAEs0CSjQLKNEsoESzgBLNAko0CyjR LKBEs4ASzQJKNAso0SygRLOAEs0CSjQLKNEsoESzgBLNAko0CyjRLKBEs4ASzQJKNAso0SygRLOA ks30y/XSNxzkzfvdi7GtXMs+C9atZMFpnudlLzjQxdm4PB+nV0vfwV1ZsG4lC/puCJRoFlCiWUCJ ZgElmgWUaBZQollAiWYBJZoFlGgWUKJZQIlmASWaBZRoFlCiWUCJZgElmgWUaBZQollAyf8AuApS zJ8+M88AAAAASUVORK5CYII= "
           preserveAspectRatio="none"
           height="80.938133"
           width="82.167564"
           clip-path="url(#clipPath839)"
           transform="matrix(2.7926094,0,0,2.7926094,-92.417198,-188.96506)"
           style="fill:#ffffff;fill-opacity:1;stroke:#000000;stroke-width:0.52763683;stroke-miterlimit:4;stroke-dasharray:none;stroke-opacity:1" />
      </g>
    </clipPath>
  </defs>
  <sodipodi:namedview
     pagecolor="#ffffff"
     bordercolor="#666666"
     borderopacity="1"
     objecttolerance="10"
     gridtolerance="10"
     guidetolerance="10"
     inkscape:pageopacity="0"
     inkscape:pageshadow="2"
     inkscape:window-width="1398"
     inkscape:window-height="851"
     id="namedview9"
     showgrid="false"
     fit-margin-top="0"
     fit-margin-left="0"
     fit-margin-right="0"
     fit-margin-bottom="0"
     inkscape:zoom="2.36"
     inkscape:cx="126.553"
     inkscape:cy="146.99431"
     inkscape:window-x="42"
     inkscape:window-y="25"
     inkscape:window-maximized="1"
     inkscape:current-layer="svg7"
     inkscape:snap-smooth-nodes="true"
     inkscape:snap-object-midpoints="true"
     inkscape:snap-text-baseline="true" />
  <title
     id="stickerIconTitle">Sticker</title>
  <circle
     style="opacity:1;vector-effect:none;fill:#ffffff;fill-opacity:1;stroke:#000000;stroke-width:0.22162442;stroke-linecap:butt;stroke-linejoin:miter;stroke-miterlimit:4;stroke-dasharray:none;stroke-dashoffset:0;stroke-opacity:1"
     id="path858"
     cx="3.1361094"
     cy="3.1361101"
     r="3.0252976" />
  <path
     inkscape:connector-curvature="0"
     style="fill:#0000ff;stroke:#004af2;stroke-width:0.05226;stroke-linecap:butt;stroke-linejoin:miter;stroke-miterlimit:4;stroke-dasharray:none;stroke-opacity:1"
     d="M 5.662246,1.707401 H 0.39999"
     id="path12" />
  <path
     inkscape:connector-curvature="0"
     style="fill:#800080;stroke:#b015ff;stroke-width:0.20999999;stroke-linecap:butt;stroke-linejoin:miter;stroke-miterlimit:4;stroke-dasharray:none;stroke-opacity:1"
     d="M 5.662249,4.560433 H 0.425414"
     id="path12-35" />
  <g
     aria-label="a"
     transform="matrix(0.15792933,0,0,0.15792933,-72.110853,-141.75319)"
     style="font-style:normal;font-variant:normal;font-weight:bold;font-stretch:normal;font-size:48px;line-height:1.25;font-family:'AA cursive';-inkscape-font-specification:'AA cursive Bold';letter-spacing:0px;word-spacing:0px;fill:#000000;fill-opacity:1;stroke:none"
     id="flowRoot839">
    <path
       d="m 476.77172,917.21404 q 0,-2.016 -1.488,-3.504 -1.44,-1.536 -3.36,-1.536 -1.92,0 -3.36,1.536 -1.392,1.488 -1.392,3.504 0,2.064 1.392,3.504 1.44,1.488 3.36,1.488 1.968,0 3.408,-1.488 1.44,-1.44 1.44,-3.504 z m 12.336,2.208 q -1.488,2.976 -3.792,5.136 -2.064,1.824 -3.84,1.824 -1.296,0 -2.304,-0.528 -0.96,-0.528 -1.536,-1.488 -2.448,2.016 -5.712,2.016 -1.872,0 -3.648,-0.576 -1.728,-0.576 -3.024,-1.968 -1.296,-1.392 -1.824,-3.024 -0.528,-1.68 -0.528,-3.6 0,-3.696 2.592,-6.432 2.688,-2.784 6.432,-2.784 2.784,0 4.896,1.44 0.432,-1.296 2.064,-1.296 2.16,0 2.16,2.064 v 10.8 q 0,1.2 0.432,1.2 0.24,0 0.768,-0.432 1.536,-1.248 3.264,-4.8 1.056,-1.872 2.304,-1.872 2.208,0 2.208,2.352 z"
       style=""
       id="path1008" />
  </g>
  <circle
     style="color:#000000;opacity:1;vector-effect:none;fill:none;fill-opacity:1;stroke:#000000;stroke-width:0.22162442;stroke-linecap:butt;stroke-linejoin:miter;stroke-miterlimit:4;stroke-dasharray:none;stroke-dashoffset:0;stroke-opacity:1"
     id="path858-0"
     cx="3.1361094"
     cy="3.1361101"
     r="3.0252974" />
</svg>
