<?xml version="1.0" encoding="UTF-8" standalone="no"?>
<!-- Created with Inkscape (http://www.inkscape.org/) -->

<svg
   xmlns:dc="http://purl.org/dc/elements/1.1/"
   xmlns:cc="http://creativecommons.org/ns#"
   xmlns:rdf="http://www.w3.org/1999/02/22-rdf-syntax-ns#"
   xmlns:svg="http://www.w3.org/2000/svg"
   xmlns="http://www.w3.org/2000/svg"
   xmlns:sodipodi="http://sodipodi.sourceforge.net/DTD/sodipodi-0.dtd"
   xmlns:inkscape="http://www.inkscape.org/namespaces/inkscape"
   width="23.757854mm"
   height="33.718071mm"
   viewBox="0 0 84.181374 119.47347"
   id="svg5223"
   version="1.1"
   inkscape:version="0.91 r13725"
   sodipodi:docname="mix-and-match-characters15.svg">
  <defs
     id="defs5225" />
  <sodipodi:namedview
     id="base"
     pagecolor="#ffffff"
     bordercolor="#666666"
     borderopacity="1.0"
     inkscape:pageopacity="0.0"
     inkscape:pageshadow="2"
     inkscape:zoom="0.98994949"
     inkscape:cx="37.936027"
     inkscape:cy="130.26344"
     inkscape:document-units="px"
     inkscape:current-layer="layer1"
     showgrid="false"
     fit-margin-top="0"
     fit-margin-left="0"
     fit-margin-right="0"
     fit-margin-bottom="0"
     inkscape:window-width="1615"
     inkscape:window-height="1026"
     inkscape:window-x="1985"
     inkscape:window-y="24"
     inkscape:window-maximized="1" />
  <metadata
     id="metadata5228">
    <rdf:RDF>
      <cc:Work
         rdf:about="">
        <dc:format>image/svg+xml</dc:format>
        <dc:type
           rdf:resource="http://purl.org/dc/dcmitype/StillImage" />
        <dc:title></dc:title>
      </cc:Work>
    </rdf:RDF>
  </metadata>
  <g
     inkscape:label="Layer 1"
     inkscape:groupmode="layer"
     id="layer1"
     transform="translate(-232.39325,-480.92922)">
    <g
       transform="translate(13.877188,26.716749)"
       id="g5926">
      <rect
         id="rect3449-5-3"
         rx="5.6687002"
         ry="4.6244998"
         transform="matrix(0.90081952,0.43419372,-0.43419372,0.90081952,0,0)"
         width="12.829"
         y="386.06738"
         x="432.84247"
         height="9.5473003"
         style="fill:#e4d3b1;fill-rule:evenodd;stroke:#060000;stroke-width:1.34259999;stroke-linecap:round;stroke-linejoin:round" />
      <rect
         id="rect3449-0-4-5"
         rx="5.6687183"
         ry="4.6245146"
         transform="matrix(-0.90081716,0.43419863,0.43419863,0.90081716,0,0)"
         width="12.829041"
         y="612.21997"
         x="-37.384544"
         height="9.5473309"
         style="fill:#e4d3b1;fill-rule:evenodd;stroke:#060000;stroke-width:1.34259999;stroke-linecap:round;stroke-linejoin:round" />
      <path
         id="path4745-1"
         d="m 228.0517,478.42 c 0,0 -11.774,21.526 -2.8939,43.262 4.2541,10.412 28.722,9.983 28.722,9.983 l -8.4176,-49.127"
         inkscape:connector-curvature="0"
         style="fill:#322b2a;stroke:#000000;stroke-width:1.04939997" />
      <rect
         id="rect3252-4-6-2-2-1-2-8"
         rx="5.9832945"
         ry="17.522984"
         transform="matrix(-0.89930089,-0.43733043,-0.43733043,0.89930089,0,0)"
         width="24.502975"
         y="349.83286"
         x="-453.522"
         height="39.318962"
         style="fill:#246671;fill-rule:evenodd;stroke:#000000;stroke-width:1.56710005;stroke-linecap:round;stroke-linejoin:round" />
      <rect
         id="rect3252-6-7-2-7-1-6-3-1-93"
         rx="26.469999"
         ry="9.1274109"
         transform="matrix(1,-7.4216e-5,0.0014835,0.9999989,0,0)"
         width="53.866001"
         y="537.16052"
         x="234.14354"
         height="33.167038"
         style="fill:#ffffff;fill-rule:evenodd;stroke:#000000;stroke-width:1.79009998;stroke-linecap:round;stroke-linejoin:round" />
      <path
         id="path3928-9-81-8-0-49-3-2-0"
         d="m 261.8017,568.95 -0.25903,-10.194"
         inkscape:connector-curvature="0"
         style="fill:#ffffff;stroke:#000000;stroke-width:1.13510001;stroke-linecap:round;stroke-linejoin:round" />
      <path
         id="path4010-7-1-8-9-8-8-6-5"
         d="m 264.3717,571.25 c 0,0 0.20132,-8.0789 9.1546,-8.5178 12.044,-0.59046 13.607,7.2787 13.607,7.2787 1.0738,2.3466 -22.857,4.5427 -22.761,1.2391 z"
         inkscape:connector-curvature="0"
         style="fill:#2c3873;stroke:#000000;stroke-width:1.51139998" />
      <path
         id="path4010-1-9-1-1-1-9-9-3-0"
         d="m 259.1817,571.26 c 0,0 -0.20294,-7.7115 -9.2297,-8.1304 -12.143,-0.56361 -13.718,6.9476 -13.718,6.9476 -1.0826,2.2399 23.044,4.3361 22.948,1.1828 z"
         inkscape:connector-curvature="0"
         style="fill:#2c3873;stroke:#000000;stroke-width:1.51139998" />
      <path
         id="path4745-4-5"
         d="m 292.1517,477.88 c 0,0 11.774,21.526 2.8939,43.262 -4.2541,10.412 -28.722,9.9829 -28.722,9.9829 l 8.4176,-49.127"
         inkscape:connector-curvature="0"
         style="fill:#322b2a;stroke:#000000;stroke-width:1.04939997" />
      <rect
         id="rect3252-71-0-6-4-3-8"
         rx="5.9833002"
         ry="17.523001"
         transform="matrix(0.89929842,-0.43733552,0.43733552,0.89929842,0,0)"
         width="24.503"
         y="576.59485"
         x="13.433831"
         height="39.319"
         style="fill:#246671;fill-rule:evenodd;stroke:#000000;stroke-width:1.56710005;stroke-linecap:round;stroke-linejoin:round" />
      <path
         id="path3932-5-3-8-0-8-51-1-3-3"
         d="m 261.0817,494.79 c -0.0995,0 -0.19906,0.009 -0.29828,0.009 l -0.43182,0 0,0.0224 c -6.6554,0.37736 -12.821,4.5148 -16.953,9.7383 -8.8563,11.122 -12.234,25.77 -12.532,39.826 0.23268,3.6052 -0.44717,7.933 1.0195,11.059 5.3293,3.3865 14.727,3.9533 21.133,4.7448 1.7001,0.0788 4.4004,0.10067 7.3322,0.1176 l 0,0.009 0.90373,0 c 0.0299,-1.7e-4 0.0592,10e-5 0.0891,0 2.9318,-0.0169 5.6321,-0.0385 7.3322,-0.1176 6.4062,-0.79149 15.804,-1.3582 21.133,-4.7448 1.4667,-3.1261 0.78682,-7.4539 1.0195,-11.059 -0.29814,-14.056 -3.6757,-28.704 -12.532,-39.826 -4.1318,-5.2235 -10.297,-9.361 -16.953,-9.7383 l 0,-0.0313 -0.26266,0 z"
         inkscape:connector-curvature="0"
         style="fill:#246671;fill-rule:evenodd;stroke:#000000;stroke-width:1.88510001;stroke-linecap:round;stroke-linejoin:round" />
      <rect
         id="rect4240-8-9-5-5"
         rx="29.983999"
         ry="25.957001"
         height="53.703999"
         width="62.653999"
         y="458.20999"
         x="229.06171"
         style="fill:#e4d3b1;fill-rule:evenodd;stroke:#000000;stroke-width:1.79009998;stroke-linecap:round;stroke-linejoin:bevel" />
      <g
         id="g588-0-5-62"
         transform="matrix(0.38549,0,0,-0.38549,272.2617,496.21)"
         style="fill:#b66b6f;stroke:#000000;stroke-width:2.32189989;stroke-linecap:round;stroke-linejoin:bevel">
        <path
           id="path590-4-2-1"
           d="M 0,0 C 0,0 -7.141,-24.844 -26.332,-24.844 -45.523,-24.844 -53.557,0 -53.557,0 L 0,0 Z"
           inkscape:connector-curvature="0"
           style="fill:#b66b6f;stroke:#000000;stroke-width:2.32189989;stroke-linecap:round;stroke-linejoin:bevel" />
      </g>
      <g
         id="g456-8-2-6"
         transform="matrix(0.50139,0,0,-0.50139,251.8017,488.34)">
        <path
           id="path458-3-6-6"
           d="m 0,0 c 0,-2.958 -2.396,-5.355 -5.355,-5.355 -2.958,0 -5.356,2.397 -5.356,5.355 0,2.957 2.398,5.356 5.356,5.356 C -2.396,5.356 0,2.957 0,0"
           inkscape:connector-curvature="0"
           style="fill:#231f20" />
      </g>
      <g
         id="g456-1-7-6"
         transform="matrix(0.50139,0,0,-0.50139,276.8617,487.89)">
        <path
           id="path458-9-9-6"
           d="m 0,0 c 0,-2.958 -2.396,-5.355 -5.355,-5.355 -2.958,0 -5.356,2.397 -5.356,5.355 0,2.957 2.398,5.356 5.356,5.356 C -2.396,5.356 0,2.957 0,0"
           inkscape:connector-curvature="0"
           style="fill:#231f20" />
      </g>
      <path
         id="rect4240-2-3-2"
         d="m 258.8517,454.66 c -17.555,0 -31.712,12.046 -32.177,27.142 1.5765,-0.20372 3.1925,-0.34137 4.8366,-0.34137 l 62.42,0 c -0.6644,-14.937 -14.754,-26.8 -32.177,-26.8 l -2.9019,0 z"
         inkscape:connector-curvature="0"
         style="fill:#322b2a;fill-rule:evenodd;stroke:#000002;stroke-width:0.89506;stroke-linecap:round;stroke-linejoin:bevel" />
    </g>
  </g>
</svg>
