<?xml version="1.0" encoding="UTF-8" standalone="no"?>
<!-- Created with Inkscape (http://www.inkscape.org/) -->

<svg
   xmlns:dc="http://purl.org/dc/elements/1.1/"
   xmlns:cc="http://creativecommons.org/ns#"
   xmlns:rdf="http://www.w3.org/1999/02/22-rdf-syntax-ns#"
   xmlns:svg="http://www.w3.org/2000/svg"
   xmlns="http://www.w3.org/2000/svg"
   xmlns:sodipodi="http://sodipodi.sourceforge.net/DTD/sodipodi-0.dtd"
   xmlns:inkscape="http://www.inkscape.org/namespaces/inkscape"
   width="23.864628mm"
   height="34.586777mm"
   viewBox="0 0 84.559705 122.55158"
   id="svg5223"
   version="1.1"
   inkscape:version="0.91 r13725"
   sodipodi:docname="mix-and-match-characters62.svg">
  <defs
     id="defs5225">
    <filter
       style="color-interpolation-filters:sRGB"
       id="filter4468">
      <feGaussianBlur
         id="feGaussianBlur4470"
         stdDeviation="0.18874514" />
    </filter>
    <filter
       style="color-interpolation-filters:sRGB"
       id="filter4468-3">
      <feGaussianBlur
         id="feGaussianBlur4470-9"
         stdDeviation="0.18874514" />
    </filter>
    <filter
       style="color-interpolation-filters:sRGB"
       id="filter4468-9">
      <feGaussianBlur
         id="feGaussianBlur4470-1"
         stdDeviation="0.18874514" />
    </filter>
    <filter
       style="color-interpolation-filters:sRGB"
       id="filter4468-39">
      <feGaussianBlur
         id="feGaussianBlur4470-17"
         stdDeviation="0.18874514" />
    </filter>
    <filter
       style="color-interpolation-filters:sRGB"
       id="filter4468-2">
      <feGaussianBlur
         id="feGaussianBlur4470-2"
         stdDeviation="0.18874514" />
    </filter>
    <filter
       style="color-interpolation-filters:sRGB"
       id="filter4468-4">
      <feGaussianBlur
         id="feGaussianBlur4470-5"
         stdDeviation="0.18874514" />
    </filter>
    <filter
       style="color-interpolation-filters:sRGB"
       id="filter4468-0">
      <feGaussianBlur
         id="feGaussianBlur4470-55"
         stdDeviation="0.18874514" />
    </filter>
    <filter
       style="color-interpolation-filters:sRGB"
       id="filter4468-01">
      <feGaussianBlur
         id="feGaussianBlur4470-3"
         stdDeviation="0.18874514" />
    </filter>
    <filter
       style="color-interpolation-filters:sRGB"
       id="filter4468-1">
      <feGaussianBlur
         id="feGaussianBlur4470-4"
         stdDeviation="0.18874514" />
    </filter>
  </defs>
  <sodipodi:namedview
     id="base"
     pagecolor="#ffffff"
     bordercolor="#666666"
     borderopacity="1.0"
     inkscape:pageopacity="0.0"
     inkscape:pageshadow="2"
     inkscape:zoom="2.8"
     inkscape:cx="-27.984006"
     inkscape:cy="38.194898"
     inkscape:document-units="px"
     inkscape:current-layer="g5084"
     showgrid="false"
     fit-margin-top="0"
     fit-margin-left="0"
     fit-margin-right="0"
     fit-margin-bottom="0"
     inkscape:window-width="1855"
     inkscape:window-height="1056"
     inkscape:window-x="65"
     inkscape:window-y="24"
     inkscape:window-maximized="1" />
  <metadata
     id="metadata5228">
    <rdf:RDF>
      <cc:Work
         rdf:about="">
        <dc:format>image/svg+xml</dc:format>
        <dc:type
           rdf:resource="http://purl.org/dc/dcmitype/StillImage" />
        <dc:title></dc:title>
      </cc:Work>
    </rdf:RDF>
  </metadata>
  <g
     inkscape:label="Layer 1"
     inkscape:groupmode="layer"
     id="layer1"
     transform="translate(-166.34466,-359.99159)">
    <g
       transform="translate(247.3811,385.33246)"
       id="g4275">
      <g
         transform="translate(-83.764786,-32.405246)"
         id="g5084">
        <path
           id="path3954-8-5-7-3-4-8-9-1-7-1"
           d="m 4.5523982,104.49804 c 1.7405815,2.46701 5.3345885,3.509 8.0274678,2.32735 2.69288,-1.18165 3.464858,-4.13945 1.724276,-6.60646 -1.740581,-2.467002 -5.3345882,-3.508993 -8.0274678,-2.327347 -2.6928795,1.181647 -3.4648574,4.139447 -1.724276,6.606457 z"
           inkscape:connector-curvature="0"
           style="fill:#ab926c;fill-rule:evenodd;stroke:#000000;stroke-width:1.7901212;stroke-linecap:round;stroke-linejoin:round" />
        <rect
           id="rect3252-4-6-2-2-4-1-2-9"
           rx="5.9832945"
           ry="17.522984"
           transform="matrix(-0.89930089,-0.43733043,-0.43733043,0.89930089,0,0)"
           width="24.502975"
           y="46.993141"
           x="-68.372375"
           height="39.318962"
           style="fill:#e66fc0;fill-rule:evenodd;stroke:#000000;stroke-width:1.56710005;stroke-linecap:round;stroke-linejoin:round" />
        <path
           id="path3954-8-5-7-3-4-8-9-1-7-1-4"
           d="m 85.464002,103.59804 c -1.740582,2.46701 -5.334589,3.509 -8.027468,2.32735 -2.69288,-1.18165 -3.464858,-4.13945 -1.724276,-6.606456 1.740581,-2.467006 5.334588,-3.508997 8.027468,-2.327351 2.692879,1.181647 3.464857,4.139447 1.724276,6.606457 z"
           inkscape:connector-curvature="0"
           style="fill:#ab926c;fill-rule:evenodd;stroke:#000000;stroke-width:1.7901212;stroke-linecap:round;stroke-linejoin:round" />
        <rect
           id="rect3252-71-0-6-0-2-7-2"
           rx="5.9833002"
           ry="17.523001"
           transform="matrix(0.89929842,-0.43733552,0.43733552,0.89929842,0,0)"
           width="24.503"
           y="86.634842"
           x="13.813828"
           height="39.319"
           style="fill:#e66fc0;fill-rule:evenodd;stroke:#000000;stroke-width:1.56710005;stroke-linecap:round;stroke-linejoin:round" />
        <rect
           id="rect3252-6-7-2-7-0-8-8-6"
           rx="18.190001"
           ry="7.5465016"
           transform="matrix(0.99999998,-1.8158e-4,6.0633989e-4,0.99999982,0,0)"
           width="55.004002"
           y="79.47979"
           x="17.632114"
           height="48.300007"
           style="fill:#5a1e3f;fill-rule:evenodd;stroke:#000000;stroke-width:1.77450001;stroke-linecap:round;stroke-linejoin:round" />
        <path
           id="path3928-9-81-8-0-8-6-6-5"
           d="m 46.3637,128.46 -0.259,-10.19"
           inkscape:connector-curvature="0"
           style="fill:none;stroke:#000000;stroke-width:1.13510001;stroke-linecap:round;stroke-linejoin:round" />
        <path
           id="path4010-7-1-8-9-3-9-0-7"
           d="m 48.9367,127.18 c 0,0 0.20133,-8.0789 9.1546,-8.5178 12.044,-0.59046 13.607,7.2787 13.607,7.2787 1.0738,2.3466 -22.857,4.5427 -22.761,1.2391 z"
           inkscape:connector-curvature="0"
           style="fill:#5a1e3f;stroke:#000000;stroke-width:1.51139998" />
        <path
           id="path4010-1-9-1-1-1-7-7-0-9"
           d="m 43.7467,127.19 c 0,0 -0.20294,-7.7114 -9.2297,-8.1304 -12.143,-0.56361 -13.718,6.9476 -13.718,6.9476 -1.0825,2.2399 23.044,4.3361 22.948,1.1827 z"
           inkscape:connector-curvature="0"
           style="fill:#5a1e3f;stroke:#000000;stroke-width:1.51139998" />
        <path
           id="path3932-5-3-8-0-8-6-6-0-8"
           d="m 45.6427,54.31 c -0.0994,0 -0.19907,0.009 -0.29828,0.009 -0.05639,0 -0.1128,0 -0.16917,-0.009 l -0.26266,0 0,0.0215 c -6.6554,0.36169 -12.821,4.3279 -16.953,9.3351 -8.8562,10.661 -12.234,24.703 -12.532,38.177 0.23267,3.4559 -0.44717,7.6045 1.0195,10.601 5.3293,3.2463 14.727,3.7896 21.133,4.5483 1.7001,0.0752 4.4004,0.0964 7.3322,0.11267 l 0,0.009 c 0.30763,0 0.60033,0 0.90372,-0.009 0.02989,-1.8e-4 0.05916,1.8e-4 0.08905,0 2.9318,-0.0161 5.6321,-0.0376 7.3322,-0.11267 6.4062,-0.75875 15.804,-1.302 21.133,-4.5483 1.4667,-2.9967 0.78681,-7.1453 1.0195,-10.601 -0.29814,-13.474 -3.6757,-27.516 -12.532,-38.177 -4.1318,-5.0071 -10.297,-8.9733 -16.953,-9.335 l 0,-0.0304 c -0.08709,-8e-5 -0.1757,0 -0.26266,0 z"
           inkscape:connector-curvature="0"
           style="fill:#dcb5c3;fill-rule:evenodd;stroke:#000000;stroke-width:1.84570003;stroke-linecap:round;stroke-linejoin:round" />
        <rect
           id="rect4240-4-5-4-7"
           rx="29.983999"
           ry="25.957001"
           height="53.703999"
           width="62.653999"
           y="15.929998"
           x="13.6247"
           style="fill:#ab926c;fill-rule:evenodd;stroke:#000000;stroke-width:1.79009998;stroke-linecap:round;stroke-linejoin:bevel" />
        <path
           id="rect4240-2-3-3-6-6"
           d="M 23.1337,7.52 C 22.0536,7.6123 20.6625,9.5462 19.6374,9.6178 18.544,9.6939 17.7885,7.3767 16.7285,7.6879 c -1.06,0.31095 -1.2711,3.291 -2.2097,3.8599 -0.93858,0.56898 -2.6274,-0.6909 -3.4404,0.0564 -0.81303,0.74638 -0.03965,2.6071 -0.61535,3.5522 -0.57573,0.94509 -2.9422,1.1062 -3.3005,2.1538 -0.35828,1.0474 1.9092,2.1576 1.8181,3.2446 -0.09106,1.0867 -2.2896,2.0419 -2.0978,3.1327 0.19179,1.0905 2.4545,1.4139 2.881,2.4334 0.4265,1.0195 -1.3673,2.8308 -0.69926,3.6921 0.66803,0.86132 3.5752,-0.32831 4.4473,0.36366 0.08808,0.0699 0.17343,0.13963 0.22377,0.2517 -1.351,2.9629 -2.134,6.172 -2.2376,9.5379 0.16509,-0.0215 0.33748,-0.0367 0.50347,-0.0555 3.8619,-9.963 16.389,-17.202 31.327,-17.202 l 2.9089,0 c 14.796,0 27.227,7.1053 31.215,16.922 l 1.2866,0 c -0.06229,-1.4002 -0.24148,-2.7725 -0.53144,-4.1116 0.17835,0.009 0.33696,-0.0349 0.4755,-0.11186 0.95368,-0.52846 0.2546,-3.2966 1.0629,-4.0278 0.80828,-0.73117 3.073,0.44423 3.6362,-0.50346 0.56315,-0.9477 -1.2974,-2.8438 -0.951,-3.888 0.34635,-1.044 3.3616,-1.0647 3.4684,-2.1537 0.10671,-1.089 -2.594,-2.3306 -2.7411,-3.4124 -0.14717,-1.0818 1.6519,-2.648 1.2307,-3.6641 -0.4212,-1.0162 -2.9788,-0.27282 -3.6641,-1.1468 -0.68537,-0.87402 0.58578,-3.5091 -0.25173,-4.2235 -0.83751,-0.71452 -2.4348,1.2471 -3.4404,0.81111 -1.0056,-0.43599 -1.2751,-3.5119 -2.3775,-3.6921 -1.1024,-0.18027 -2.6266,2.0214 -3.7201,2.0978 -1.0934,0.0761 -1.8489,-2.2411 -2.9089,-1.93 -1.06,0.31112 -1.2711,3.291 -2.2097,3.8599 -0.93858,0.56898 -2.6274,-0.69 -3.4404,0.0555 -0.59284,0.5443 -0.32115,1.6906 -0.36362,2.6292 -4.5806,-2.1647 -9.832,-3.4124 -15.44,-3.4124 l -2.9089,0 c -4.5639,0 -8.8867,0.82328 -12.811,2.2936 -0.60612,-0.0439 -1.1573,-0.13214 -1.4265,-0.47546 -0.68537,-0.87412 0.55781,-3.5371 -0.2797,-4.2515 -0.83751,-0.71452 -2.4068,1.2752 -3.4124,0.83903 -1.0056,-0.4359 -1.2751,-3.5118 -2.3775,-3.6921 -0.06892,-0.0107 -0.15176,-0.009 -0.22376,0 z"
           inkscape:connector-curvature="0"
           style="fill:#69383d;fill-rule:evenodd;stroke:#000002;stroke-width:0.89506;stroke-linecap:round;stroke-linejoin:bevel" />
        <g
           id="g8516-4"
           transform="matrix(0.36982,0,0,0.48445,226.6617,-1143.05)"
           style="fill:none;stroke:#ca3f8a;stroke-width:39.40200043;stroke-linecap:round;stroke-linejoin:bevel">
          <g
             id="g8472-0"
             transform="matrix(0.22884,0,0,0.32281,-434.24,1726.1)">
            <g
               id="g8444-11">
              <path
                 id="path8424-98"
                 d="m -560.32,2545.7 c 48.727,-11.127 48.922,-90.633 81.178,-98.636"
                 inkscape:connector-curvature="0" />
              <path
                 id="path8424-7-9"
                 d="m -399.41,2545.7 c -48.727,-11.127 -48.922,-90.633 -81.178,-98.636"
                 inkscape:connector-curvature="0" />
            </g>
            <g
               id="g8444-1-0"
               transform="translate(159.86,-1.7e-5)">
              <path
                 id="path8424-9-6"
                 d="m -560.32,2545.7 c 48.727,-11.127 48.922,-90.633 81.178,-98.636"
                 inkscape:connector-curvature="0" />
              <path
                 id="path8424-7-6-9"
                 d="m -399.41,2545.7 c -48.727,-11.127 -48.922,-90.633 -81.178,-98.636"
                 inkscape:connector-curvature="0" />
            </g>
          </g>
          <g
             id="g8472-7-5"
             transform="matrix(0.22884,0,0,0.32281,-361.48,1726.5)">
            <g
               id="g8444-7-1">
              <path
                 id="path8424-97-1"
                 d="m -560.32,2545.7 c 48.727,-11.127 48.922,-90.633 81.178,-98.636"
                 inkscape:connector-curvature="0" />
              <path
                 id="path8424-7-2-5"
                 d="m -399.41,2545.7 c -48.727,-11.127 -48.922,-90.633 -81.178,-98.636"
                 inkscape:connector-curvature="0" />
            </g>
            <g
               id="g8444-1-7-6"
               transform="translate(159.86,-1.7e-5)">
              <path
                 id="path8424-9-3-0"
                 d="m -560.32,2545.7 c 48.727,-11.127 48.922,-90.633 81.178,-98.636"
                 inkscape:connector-curvature="0" />
              <path
                 id="path8424-7-6-5-3"
                 d="m -399.41,2545.7 c -48.727,-11.127 -48.922,-90.633 -81.178,-98.636"
                 inkscape:connector-curvature="0" />
            </g>
          </g>
        </g>
        <g
           id="g456-8-2-1-4-8"
           transform="matrix(0.46681006,0,0,-0.46681003,33.116858,46.612364)">
          <path
             id="path458-3-6-8-8-1"
             d="m 0,0 c 0,-2.958 -2.396,-5.355 -5.355,-5.355 -2.958,0 -5.356,2.397 -5.356,5.355 0,2.957 2.398,5.356 5.356,5.356 C -2.396,5.356 0,2.957 0,0"
             inkscape:connector-curvature="0" />
        </g>
        <g
           id="g456-1-7-8-0-9"
           transform="matrix(0.46681006,0,0,-0.46681003,61.116861,46.112364)">
          <path
             id="path458-9-9-9-1-08"
             d="m 0,0 c 0,-2.958 -2.396,-5.355 -5.355,-5.355 -2.958,0 -5.356,2.397 -5.356,5.355 0,2.957 2.398,5.356 5.356,5.356 C -2.396,5.356 0,2.957 0,0"
             inkscape:connector-curvature="0" />
        </g>
        <path
           id="path3831-2-0-3-22-6-5-2"
           d="m 28.896858,50.162366 3.3002,0"
           inkscape:connector-curvature="0"
           style="fill:#ffffff;stroke:#000000;stroke-width:0.83653998;stroke-linecap:round;stroke-linejoin:round" />
        <path
           id="path3831-2-0-3-22-6-5-2-5"
           d="m 26.046857,45.632366 6.325001,-2.233701"
           inkscape:connector-curvature="0"
           style="fill:#ffffff;stroke:#000000;stroke-width:0.94016999;stroke-linecap:round;stroke-linejoin:round" />
        <path
           id="path3831-2-0-3-22-6-5-2-1"
           d="m 60.506861,49.572366 -3.3002,0"
           inkscape:connector-curvature="0"
           style="fill:#ffffff;stroke:#000000;stroke-width:0.83653998;stroke-linecap:round;stroke-linejoin:round" />
        <path
           id="path3831-2-0-3-22-6-5-2-5-3"
           d="m 63.546862,45.032365 -6.513501,-2.2222"
           inkscape:connector-curvature="0"
           style="fill:#ffffff;stroke:#000000;stroke-width:0.95163;stroke-linecap:round;stroke-linejoin:round" />
        <path
           id="path3831-2-0-3-22-6-5-2-9-7"
           d="m 42.656869,57.562366 7.702701,0.001"
           inkscape:connector-curvature="0"
           style="fill:#ffffff;stroke:#000000;stroke-width:0.67273998;stroke-linecap:round;stroke-linejoin:round" />
      </g>
    </g>
  </g>
</svg>
