<?xml version="1.0" encoding="UTF-8" standalone="no"?>
<svg
   xmlns:dc="http://purl.org/dc/elements/1.1/"
   xmlns:cc="http://creativecommons.org/ns#"
   xmlns:rdf="http://www.w3.org/1999/02/22-rdf-syntax-ns#"
   xmlns:svg="http://www.w3.org/2000/svg"
   xmlns="http://www.w3.org/2000/svg"
   xmlns:xlink="http://www.w3.org/1999/xlink"
   xmlns:sodipodi="http://sodipodi.sourceforge.net/DTD/sodipodi-0.dtd"
   xmlns:inkscape="http://www.inkscape.org/namespaces/inkscape"
   id="svg8"
   version="1.1"
   viewBox="0 0 3.141927 6.283854"
   height="23.75"
   width="11.875"
   sodipodi:docname="ligatures.svg"
   inkscape:version="0.92.5 (2060ec1f9f, 2020-04-08)">
  <sodipodi:namedview
     pagecolor="#ffffff"
     bordercolor="#666666"
     borderopacity="1"
     objecttolerance="10"
     gridtolerance="10"
     guidetolerance="10"
     inkscape:pageopacity="0"
     inkscape:pageshadow="2"
     inkscape:window-width="1398"
     inkscape:window-height="851"
     id="namedview44"
     showgrid="false"
     inkscape:zoom="28.105634"
     inkscape:cx="1.3551417"
     inkscape:cy="10.589974"
     inkscape:window-x="42"
     inkscape:window-y="25"
     inkscape:window-maximized="1"
     inkscape:current-layer="svg8"
     units="px"
     inkscape:snap-nodes="false" />
  <defs
     id="defs2">
    <radialGradient
       gradientTransform="matrix(-78.546009,36.100557,-15.281477,-33.248766,7.0762376,157.9755)"
       gradientUnits="userSpaceOnUse"
       r="1"
       cy="0"
       cx="0"
       id="paint3_radial">
      <stop
         id="stop45"
         stop-opacity="0.25"
         stop-color="#440063" />
      <stop
         id="stop47"
         stop-opacity="0"
         stop-color="#420061"
         offset="1" />
    </radialGradient>
    <radialGradient
       gradientTransform="matrix(-78.546009,36.100557,-15.281477,-33.248766,6.4247681,158.96106)"
       gradientUnits="userSpaceOnUse"
       r="1"
       cy="0"
       cx="0"
       id="paint3_radial-1">
      <stop
         id="stop45-8"
         stop-opacity="0.25"
         stop-color="#440063" />
      <stop
         id="stop47-7"
         stop-opacity="0"
         stop-color="#420061"
         offset="1" />
    </radialGradient>
    <radialGradient
       gradientTransform="matrix(-8.677562,3.9882971,-1.6882585,-3.6732386,-63.920962,185.41278)"
       gradientUnits="userSpaceOnUse"
       r="1"
       cy="0"
       cx="0"
       id="paint3_radial-5">
      <stop
         id="stop45-1"
         stop-opacity="0.25"
         stop-color="#440063" />
      <stop
         id="stop47-1"
         stop-opacity="0"
         stop-color="#420061"
         offset="1" />
    </radialGradient>
    <radialGradient
       gradientTransform="matrix(-3.586293,7.3111659,-3.7468047,-1.8378926,-60.210833,177.55322)"
       gradientUnits="userSpaceOnUse"
       r="1"
       cy="0"
       cx="0"
       id="paint2_radial">
      <stop
         id="stop34"
         stop-opacity="0.75"
         stop-color="#FBE07A" />
      <stop
         id="stop36"
         stop-opacity="0.6897"
         stop-color="#FBE387"
         offset="0.0803394" />
      <stop
         id="stop38"
         stop-opacity="0.362"
         stop-color="#FDF2C7"
         offset="0.5173" />
      <stop
         id="stop40"
         stop-opacity="0.1233"
         stop-color="#FFFBF0"
         offset="0.8357" />
      <stop
         id="stop42"
         stop-opacity="0"
         stop-color="white"
         offset="1" />
    </radialGradient>
    <linearGradient
       gradientUnits="userSpaceOnUse"
       y2="23.6215"
       x2="7.4344301"
       y1="0.62542599"
       x1="15.2501"
       id="paint1_linear"
       gradientTransform="matrix(0.97434962,0,0,0.97434962,-75.266483,168.82497)">
      <stop
         id="stop21"
         stop-color="#90D856"
         offset="0.2544" />
      <stop
         id="stop23"
         stop-color="#00CC00"
         offset="0.736" />
      <stop
         id="stop25"
         stop-color="#0BCD07"
         offset="0.7716" />
      <stop
         id="stop27"
         stop-color="#29CF18"
         offset="0.8342" />
      <stop
         id="stop29"
         stop-color="#59D335"
         offset="0.9166" />
      <stop
         id="stop31"
         stop-color="#90D856"
         offset="1" />
    </linearGradient>
    <linearGradient
       gradientUnits="userSpaceOnUse"
       y2="23.917101"
       x2="9.8253298"
       y1="-13.9667"
       x1="15.825"
       id="paint0_linear"
       gradientTransform="matrix(0.97434962,0,0,0.97434962,-75.266483,168.82497)">
      <stop
         id="stop10"
         stop-color="#00CC00" />
      <stop
         id="stop12"
         stop-color="#06C102"
         offset="0.1878" />
      <stop
         id="stop14"
         stop-color="#17A306"
         offset="0.5185" />
      <stop
         id="stop16"
         stop-color="#33740C"
         offset="0.9507" />
      <stop
         id="stop18"
         stop-color="#366E0D"
         offset="1" />
    </linearGradient>
    <radialGradient
       gradientTransform="matrix(-3.586293,7.3111659,-3.7468047,-1.8378926,-60.210833,177.55322)"
       gradientUnits="userSpaceOnUse"
       r="1"
       cy="0"
       cx="0"
       id="paint2_radial-7">
      <stop
         id="stop34-0"
         stop-opacity="0.75"
         stop-color="#FBE07A" />
      <stop
         id="stop36-9"
         stop-opacity="0.6897"
         stop-color="#FBE387"
         offset="0.0803394" />
      <stop
         id="stop38-3"
         stop-opacity="0.362"
         stop-color="#FDF2C7"
         offset="0.5173" />
      <stop
         id="stop40-6"
         stop-opacity="0.1233"
         stop-color="#FFFBF0"
         offset="0.8357" />
      <stop
         id="stop42-0"
         stop-opacity="0"
         stop-color="white"
         offset="1" />
    </radialGradient>
    <radialGradient
       gradientTransform="matrix(-8.677562,3.9882971,-1.6882585,-3.6732386,-63.920962,185.41278)"
       gradientUnits="userSpaceOnUse"
       r="1"
       cy="0"
       cx="0"
       id="paint3_radial-5-6">
      <stop
         id="stop45-1-2"
         stop-opacity="0.25"
         stop-color="#440063" />
      <stop
         id="stop47-1-6"
         stop-opacity="0"
         stop-color="#420061"
         offset="1" />
    </radialGradient>
    <linearGradient
       inkscape:collect="always"
       xlink:href="#paint0_linear"
       id="linearGradient139"
       gradientUnits="userSpaceOnUse"
       gradientTransform="matrix(0.97434962,0,0,0.97434962,-75.266483,168.82497)"
       x1="15.825"
       y1="-13.9667"
       x2="9.8253298"
       y2="23.917101" />
    <linearGradient
       inkscape:collect="always"
       xlink:href="#paint1_linear"
       id="linearGradient141"
       gradientUnits="userSpaceOnUse"
       gradientTransform="matrix(0.97434962,0,0,0.97434962,-75.266483,168.82497)"
       x1="15.2501"
       y1="0.62542599"
       x2="7.4344301"
       y2="23.6215" />
  </defs>
  <metadata
     id="metadata5">
    <rdf:RDF>
      <cc:Work
         rdf:about="">
        <dc:format>image/svg+xml</dc:format>
        <dc:type
           rdf:resource="http://purl.org/dc/dcmitype/StillImage" />
        <dc:title></dc:title>
      </cc:Work>
    </rdf:RDF>
  </metadata>
  <circle
     style="opacity:1;vector-effect:none;fill:#46afed;fill-opacity:1;stroke:none;stroke-width:46.38288498;stroke-linecap:butt;stroke-linejoin:miter;stroke-miterlimit:4;stroke-dasharray:none;stroke-dashoffset:0;stroke-opacity:1"
     id="path833"
     cx="1.5709633"
     cy="4.7128901"
     r="1.5709635" />
  <g
     aria-label="╠"
     style="font-style:normal;font-variant:normal;font-weight:normal;font-stretch:normal;font-size:4.23333311px;line-height:1.25;font-family:'AA cursive';-inkscape-font-specification:'AA cursive';letter-spacing:0px;word-spacing:0px;fill:#ff2d00;fill-opacity:1;stroke:none;stroke-width:0.26458332"
     id="text829-3"
     transform="translate(0,3.141927)">
    <path
       d="m 0.98112227,1.415255 q -0.008467,0.016933 -0.0127,0.029633 -0.004233,0.0127 -0.008467,0.0254 0.0592667,0.016933 0.0846667,0.0635 0.0254,0.042333 0.042333,0.093133 l -0.00423,-0.0127 q 0,0.016933 0.00423,0.0254 v -0.00423 q 0.00847,0.00847 0.0381,0.029633 0.033867,0.021167 0.080433,0.042333 0.1100667,0.055033 0.1608667,0.055033 0.127,0 0.1947333,-0.0762 0.067733,-0.080433 0.055033,-0.2032 -0.0381,-0.2032 -0.1778,-0.3217333 h 0.00423 q -0.0762,-0.055033 -0.1439333,-0.1016 -0.067733,-0.0508 -0.1143,-0.0973667 -0.00847,0.0211667 -0.021167,0.0423333 -0.00847,0.021167 -0.016933,0.042333 -0.0381,0.0762 -0.080433,0.1693333 -0.0381,0.0889 -0.0846666,0.1989666 z M 2.5601555,1.3432884 q 0,0.0127 0,0.021167 0,0.00423 -0.00847,0.0254 v 0.00423 Q 2.2511222,2.1095217 1.5399222,2.1095217 H 1.3663556 q -0.1820333,0 -0.38523333,-0.127 -0.11853332,-0.059267 -0.18626665,-0.1524 -0.008467,0.0127 -0.0127,0.021167 0,0.00847 -0.004233,0.016933 v -0.00423 q -0.0804333,0.1820334 -0.19473332,0.1820334 -0.17779999,0 -0.17779999,-0.1693334 0,-0.042333 0.0423333,-0.1227666 l -0.004233,0.00423 Q 0.51545563,1.5845884 0.59588896,1.4194884 0.67632229,1.250155 0.74828895,1.0808217 v 0.00423 q 0.0338667,-0.084667 0.0846667,-0.1862667 0.0508,-0.10583333 0.11006666,-0.21589999 -0.0169333,-0.0211667 -0.0296333,-0.0423333 -0.008467,-0.0254 -0.0169333,-0.0508 -0.008467,-0.19896665 0.14393329,-0.25399998 0.055033,-0.0169333 0.1100667,-0.008467 0.059267,0.004233 0.1016,0.0381 0.046567,0.0338667 0.071967,0.0931333 0.0254,0.0592667 0.0127,0.13969999 l -0.00423,0.0169333 q -0.00847,0.0296333 -0.00423,0.0211667 0.00423,-0.008467 0.00423,-0.004233 0.0508,0.0592667 0.1227667,0.1143 0.071967,0.0550333 0.1651,0.12699999 0.2836333,0.22436669 0.3217333,0.50799999 0.00423,0.029633 0.00423,0.067733 0.00423,0.0381 0.00423,0.071967 0,0.033867 0,0.0635 0,0.0254 -0.00423,0.055033 0.1143,-0.084667 0.1947333,-0.2286 0.021167,-0.033867 0.0381,-0.0635 0.021167,-0.033867 0.029633,-0.059267 0.0254,-0.033867 0.029633,-0.042333 0.046567,-0.071967 0.1397,-0.071967 0.1820333,0 0.1820333,0.1693333 z"
       style="font-style:normal;font-variant:normal;font-weight:bold;font-stretch:normal;font-family:'AA cursive';-inkscape-font-specification:'AA cursive Bold';fill:#ff2d00;fill-opacity:1;stroke-width:0.26458332"
       id="path59"
       inkscape:connector-curvature="0" />
  </g>
  <g
     aria-label="s"
     style="font-style:normal;font-variant:normal;font-weight:normal;font-stretch:normal;font-size:4.23333311px;line-height:1.25;font-family:'AA cursive';-inkscape-font-specification:'AA cursive';letter-spacing:0px;word-spacing:0px;fill:#000000;fill-opacity:1;stroke:none;stroke-width:0.26458332"
     id="text829"
     transform="translate(0,3.141927)">
    <path
       d="m 1.0205515,1.3353663 q -0.0211667,0.046567 -0.0423333,0.080433 -0.0211667,0.029633 -0.0423333,0.0508 0.0804334,0.00847 0.1058334,0.055033 0.0254,0.046567 0.046567,0.1016 l -0.00423,-0.0127 q 0,0.016933 0.00423,0.0254 v -0.00423 q 0.016933,0.021167 0.1185334,0.0762 0.1142999,0.0508 0.1608666,0.0508 0.127,0 0.1947333,-0.0762 0.067733,-0.0762 0.055033,-0.2032 -0.0381,-0.2032 -0.1778,-0.3175 h 0.00423 Q 1.2872515,1.051733 1.1856515,0.96283303 1.1560182,1.0220997 1.1306182,1.0855997 q -0.0381,0.0889 -0.067733,0.1524 -0.0254,0.059267 -0.042333,0.1016 z m 0.3132666,0.7789333 q -0.2116666,-0.0381 -0.35559993,-0.127 l 0.004233,0.00423 Q 0.73268485,1.8433663 0.73268485,1.6401663 q 0,-0.0762 0.0423333,-0.127 -0.127,-0.016933 -0.127,-0.1693333 0,-0.0127 0.008467,-0.042333 0.004233,-0.033867 0.0254,-0.0762 0.0127,-0.029633 0.0338667,-0.071967 0.0169333,-0.046567 0.0338667,-0.071967 0.0338667,-0.080433 0.0846667,-0.1862667 0.0550333,-0.11006666 0.11006666,-0.21589999 -0.0169333,-0.0211667 -0.0296333,-0.0423333 -0.008467,-0.0254 -0.0169333,-0.0508 -0.008467,-0.19896666 0.14393339,-0.25399999 0.055033,-0.0169333 0.1100666,-0.008467 0.059267,0.008467 0.1016,0.0423333 0.046567,0.0338667 0.071967,0.0931333 0.0254,0.0592667 0.0127,0.13969999 l -0.00423,0.0127 q -0.00847,0.0338667 -0.00423,0.0254 0.00423,-0.0127 0,-0.008467 0.055033,0.0592667 0.127,0.11853333 0.071967,0.0550333 0.1651,0.12276666 0.2836333,0.2286 0.3217333,0.5122333 l -0.00423,-0.00847 q 0.00847,0.0508 0.0127,0.093133 0.00423,0.042333 0.00423,0.084667 0,0.1947334 -0.0889,0.3344333 -0.059267,0.071967 -0.1185333,0.1185334 -0.059267,0.046567 -0.1185333,0.067733 -0.0635,0.0254 -0.1397,0.0381 -0.071967,0.0127 -0.1481667,0.00423 z"
       style="font-style:normal;font-variant:normal;font-weight:bold;font-stretch:normal;font-family:'AA cursive';-inkscape-font-specification:'AA cursive Bold';stroke-width:0.26458332"
       id="path56"
       inkscape:connector-curvature="0" />
  </g>
  <g
     id="g937"
     transform="matrix(0.09680627,0,0,0.09680627,8.301489,-12.120029)">
    <path
       inkscape:connector-curvature="0"
       id="path2"
       d="m -70.4728,180.76757 c -0.61801,0 -1.236031,0.25616 -1.675881,0.75727 -0.395304,0.44537 -0.590174,1.01888 -0.5512,1.61459 0.03897,0.59572 0.306229,1.1358 0.751643,1.5311 l 4.003184,3.51321 c 0.40644,0.35642 0.929812,0.55684 1.469875,0.55684 0.06125,0 0.122495,0 0.183733,-0.006 0.60132,-0.0502 1.163656,-0.34521 1.542288,-0.8129 l 9.804686,-12.00402 c 0.77948,-0.95208 0.634789,-2.3607 -0.317346,-3.14018 -0.462134,-0.37304 -1.04119,-0.55121 -1.631354,-0.48996 -0.590164,0.0612 -1.124691,0.3452 -1.503227,0.80731 l -8.346025,10.21117 -2.266065,-1.98768 c -0.417577,-0.36742 -0.946512,-0.55119 -1.464311,-0.55119 z"
       style="fill:url(#paint0_linear);stroke-width:0.97434962" />
    <path
       inkscape:connector-curvature="0"
       id="path4"
       d="m -66.475131,188.33964 c -0.445414,0 -0.874128,-0.16145 -1.208193,-0.45658 l -4.003184,-3.51322 c -0.757206,-0.66811 -0.835154,-1.82622 -0.167033,-2.58339 0.668131,-0.75726 1.826214,-0.83521 2.58342,-0.167 l 2.577856,2.26049 8.602104,-10.53415 c 0.640246,-0.78505 1.792804,-0.8964 2.577838,-0.26168 0.785033,0.64028 0.896402,1.7928 0.26171,2.57784 l -9.810337,12.00402 c -0.311792,0.38419 -0.773897,0.62358 -1.263848,0.66811 -0.05011,0 -0.100222,0.006 -0.150333,0.006 z"
       style="fill:url(#paint1_linear);stroke-width:0.97434962" />
    <path
       inkscape:connector-curvature="0"
       id="path6"
       d="m -66.475131,188.33964 c -0.445414,0 -0.874128,-0.16145 -1.208193,-0.45658 l -4.003184,-3.51322 c -0.757206,-0.66811 -0.835154,-1.82622 -0.167033,-2.58339 0.668131,-0.75726 1.826214,-0.83521 2.58342,-0.167 l 2.577856,2.26049 8.602104,-10.53415 c 0.640246,-0.78505 1.792804,-0.8964 2.577838,-0.26168 0.785033,0.64028 0.896402,1.7928 0.26171,2.57784 l -9.810337,12.00402 c -0.311792,0.38419 -0.773897,0.62358 -1.263848,0.66811 -0.05011,0 -0.100222,0.006 -0.150333,0.006 z"
       style="opacity:0.75;fill:url(#paint2_radial);stroke-width:0.97434962" />
    <path
       inkscape:connector-curvature="0"
       id="path8-03"
       d="m -66.475131,188.33964 c -0.445414,0 -0.874128,-0.16145 -1.208193,-0.45658 l -4.003184,-3.51322 c -0.757206,-0.66811 -0.835154,-1.82622 -0.167033,-2.58339 0.668131,-0.75726 1.826214,-0.83521 2.58342,-0.167 l 2.577856,2.26049 8.602104,-10.53415 c 0.640246,-0.78505 1.792804,-0.8964 2.577838,-0.26168 0.785033,0.64028 0.896402,1.7928 0.26171,2.57784 l -9.810337,12.00402 c -0.311792,0.38419 -0.773897,0.62358 -1.263848,0.66811 -0.05011,0 -0.100222,0.006 -0.150333,0.006 z"
       style="opacity:0.5;fill:url(#paint3_radial-5);stroke-width:0.97434962" />
  </g>
  <circle
     style="opacity:1;vector-effect:none;fill:#85d2ff;fill-opacity:1;stroke:none;stroke-width:46.38288879;stroke-linecap:butt;stroke-linejoin:miter;stroke-miterlimit:4;stroke-dasharray:none;stroke-dashoffset:0;stroke-opacity:1"
     id="path833-1"
     cx="1.5709635"
     cy="1.5709635"
     r="1.5709635" />
  <g
     aria-label="╠"
     style="font-style:normal;font-variant:normal;font-weight:normal;font-stretch:normal;font-size:4.23333311px;line-height:1.25;font-family:'AA cursive';-inkscape-font-specification:'AA cursive';letter-spacing:0px;word-spacing:0px;fill:#ff2d00;fill-opacity:1;stroke:none;stroke-width:0.26458332"
     id="text829-3-8">
    <path
       d="m 0.98112227,1.415255 q -0.008467,0.016933 -0.0127,0.029633 -0.004233,0.0127 -0.008467,0.0254 0.0592667,0.016933 0.0846667,0.0635 0.0254,0.042333 0.042333,0.093133 l -0.00423,-0.0127 q 0,0.016933 0.00423,0.0254 v -0.00423 q 0.00847,0.00847 0.0381,0.029633 0.033867,0.021167 0.080433,0.042333 0.1100667,0.055033 0.1608667,0.055033 0.127,0 0.1947333,-0.0762 0.067733,-0.080433 0.055033,-0.2032 -0.0381,-0.2032 -0.1778,-0.3217333 h 0.00423 q -0.0762,-0.055033 -0.1439333,-0.1016 -0.067733,-0.0508 -0.1143,-0.0973667 -0.00847,0.0211667 -0.021167,0.0423333 -0.00847,0.021167 -0.016933,0.042333 -0.0381,0.0762 -0.080433,0.1693333 -0.0381,0.0889 -0.0846666,0.1989666 z M 2.5601555,1.3432884 q 0,0.0127 0,0.021167 0,0.00423 -0.00847,0.0254 v 0.00423 Q 2.2511222,2.1095217 1.5399222,2.1095217 H 1.3663556 q -0.1820333,0 -0.38523333,-0.127 -0.11853332,-0.059267 -0.18626665,-0.1524 -0.008467,0.0127 -0.0127,0.021167 0,0.00847 -0.004233,0.016933 v -0.00423 q -0.0804333,0.1820334 -0.19473332,0.1820334 -0.17779999,0 -0.17779999,-0.1693334 0,-0.042333 0.0423333,-0.1227666 l -0.004233,0.00423 Q 0.51545563,1.5845884 0.59588896,1.4194884 0.67632229,1.250155 0.74828895,1.0808217 v 0.00423 q 0.0338667,-0.084667 0.0846667,-0.1862667 0.0508,-0.10583333 0.11006666,-0.21589999 -0.0169333,-0.0211667 -0.0296333,-0.0423333 -0.008467,-0.0254 -0.0169333,-0.0508 -0.008467,-0.19896665 0.14393329,-0.25399998 0.055033,-0.0169333 0.1100667,-0.008467 0.059267,0.004233 0.1016,0.0381 0.046567,0.0338667 0.071967,0.0931333 0.0254,0.0592667 0.0127,0.13969999 l -0.00423,0.0169333 q -0.00847,0.0296333 -0.00423,0.0211667 0.00423,-0.008467 0.00423,-0.004233 0.0508,0.0592667 0.1227667,0.1143 0.071967,0.0550333 0.1651,0.12699999 0.2836333,0.22436669 0.3217333,0.50799999 0.00423,0.029633 0.00423,0.067733 0.00423,0.0381 0.00423,0.071967 0,0.033867 0,0.0635 0,0.0254 -0.00423,0.055033 0.1143,-0.084667 0.1947333,-0.2286 0.021167,-0.033867 0.0381,-0.0635 0.021167,-0.033867 0.029633,-0.059267 0.0254,-0.033867 0.029633,-0.042333 0.046567,-0.071967 0.1397,-0.071967 0.1820333,0 0.1820333,0.1693333 z"
       style="font-style:normal;font-variant:normal;font-weight:bold;font-stretch:normal;font-family:'AA cursive';-inkscape-font-specification:'AA cursive Bold';fill:#ff2d00;fill-opacity:1;stroke-width:0.26458332"
       id="path59-7"
       inkscape:connector-curvature="0" />
  </g>
  <g
     aria-label="s"
     style="font-style:normal;font-variant:normal;font-weight:normal;font-stretch:normal;font-size:4.23333311px;line-height:1.25;font-family:'AA cursive';-inkscape-font-specification:'AA cursive';letter-spacing:0px;word-spacing:0px;fill:#000000;fill-opacity:1;stroke:none;stroke-width:0.26458332"
     id="text829-9">
    <path
       d="m 1.0205515,1.3353663 q -0.0211667,0.046567 -0.0423333,0.080433 -0.0211667,0.029633 -0.0423333,0.0508 0.0804334,0.00847 0.1058334,0.055033 0.0254,0.046567 0.046567,0.1016 l -0.00423,-0.0127 q 0,0.016933 0.00423,0.0254 v -0.00423 q 0.016933,0.021167 0.1185334,0.0762 0.1142999,0.0508 0.1608666,0.0508 0.127,0 0.1947333,-0.0762 0.067733,-0.0762 0.055033,-0.2032 -0.0381,-0.2032 -0.1778,-0.3175 h 0.00423 Q 1.2872515,1.051733 1.1856515,0.96283303 1.1560182,1.0220997 1.1306182,1.0855997 q -0.0381,0.0889 -0.067733,0.1524 -0.0254,0.059267 -0.042333,0.1016 z m 0.3132666,0.7789333 q -0.2116666,-0.0381 -0.35559993,-0.127 l 0.004233,0.00423 Q 0.73268485,1.8433663 0.73268485,1.6401663 q 0,-0.0762 0.0423333,-0.127 -0.127,-0.016933 -0.127,-0.1693333 0,-0.0127 0.008467,-0.042333 0.004233,-0.033867 0.0254,-0.0762 0.0127,-0.029633 0.0338667,-0.071967 0.0169333,-0.046567 0.0338667,-0.071967 0.0338667,-0.080433 0.0846667,-0.1862667 0.0550333,-0.11006666 0.11006666,-0.21589999 -0.0169333,-0.0211667 -0.0296333,-0.0423333 -0.008467,-0.0254 -0.0169333,-0.0508 -0.008467,-0.19896666 0.14393339,-0.25399999 0.055033,-0.0169333 0.1100666,-0.008467 0.059267,0.008467 0.1016,0.0423333 0.046567,0.0338667 0.071967,0.0931333 0.0254,0.0592667 0.0127,0.13969999 l -0.00423,0.0127 q -0.00847,0.0338667 -0.00423,0.0254 0.00423,-0.0127 0,-0.008467 0.055033,0.0592667 0.127,0.11853333 0.071967,0.0550333 0.1651,0.12276666 0.2836333,0.2286 0.3217333,0.5122333 l -0.00423,-0.00847 q 0.00847,0.0508 0.0127,0.093133 0.00423,0.042333 0.00423,0.084667 0,0.1947334 -0.0889,0.3344333 -0.059267,0.071967 -0.1185333,0.1185334 -0.059267,0.046567 -0.1185333,0.067733 -0.0635,0.0254 -0.1397,0.0381 -0.071967,0.0127 -0.1481667,0.00423 z"
       style="font-style:normal;font-variant:normal;font-weight:bold;font-stretch:normal;font-family:'AA cursive';-inkscape-font-specification:'AA cursive Bold';stroke-width:0.26458332"
       id="path56-2"
       inkscape:connector-curvature="0" />
  </g>
  <g
     id="g937-0"
     transform="matrix(0.09680627,0,0,0.09680627,8.3014893,-15.261956)">
    <path
       inkscape:connector-curvature="0"
       id="path2-2"
       d="m -70.4728,180.76757 c -0.61801,0 -1.236031,0.25616 -1.675881,0.75727 -0.395304,0.44537 -0.590174,1.01888 -0.5512,1.61459 0.03897,0.59572 0.306229,1.1358 0.751643,1.5311 l 4.003184,3.51321 c 0.40644,0.35642 0.929812,0.55684 1.469875,0.55684 0.06125,0 0.122495,0 0.183733,-0.006 0.60132,-0.0502 1.163656,-0.34521 1.542288,-0.8129 l 9.804686,-12.00402 c 0.77948,-0.95208 0.634789,-2.3607 -0.317346,-3.14018 -0.462134,-0.37304 -1.04119,-0.55121 -1.631354,-0.48996 -0.590164,0.0612 -1.124691,0.3452 -1.503227,0.80731 l -8.346025,10.21117 -2.266065,-1.98768 c -0.417577,-0.36742 -0.946512,-0.55119 -1.464311,-0.55119 z"
       style="fill:url(#linearGradient139);stroke-width:0.97434962" />
    <path
       inkscape:connector-curvature="0"
       id="path4-3"
       d="m -66.475131,188.33964 c -0.445414,0 -0.874128,-0.16145 -1.208193,-0.45658 l -4.003184,-3.51322 c -0.757206,-0.66811 -0.835154,-1.82622 -0.167033,-2.58339 0.668131,-0.75726 1.826214,-0.83521 2.58342,-0.167 l 2.577856,2.26049 8.602104,-10.53415 c 0.640246,-0.78505 1.792804,-0.8964 2.577838,-0.26168 0.785033,0.64028 0.896402,1.7928 0.26171,2.57784 l -9.810337,12.00402 c -0.311792,0.38419 -0.773897,0.62358 -1.263848,0.66811 -0.05011,0 -0.100222,0.006 -0.150333,0.006 z"
       style="fill:url(#linearGradient141);stroke-width:0.97434962" />
    <path
       inkscape:connector-curvature="0"
       id="path6-7"
       d="m -66.475131,188.33964 c -0.445414,0 -0.874128,-0.16145 -1.208193,-0.45658 l -4.003184,-3.51322 c -0.757206,-0.66811 -0.835154,-1.82622 -0.167033,-2.58339 0.668131,-0.75726 1.826214,-0.83521 2.58342,-0.167 l 2.577856,2.26049 8.602104,-10.53415 c 0.640246,-0.78505 1.792804,-0.8964 2.577838,-0.26168 0.785033,0.64028 0.896402,1.7928 0.26171,2.57784 l -9.810337,12.00402 c -0.311792,0.38419 -0.773897,0.62358 -1.263848,0.66811 -0.05011,0 -0.100222,0.006 -0.150333,0.006 z"
       style="opacity:0.75;fill:url(#paint2_radial-7);stroke-width:0.97434962" />
    <path
       inkscape:connector-curvature="0"
       id="path8-03-5"
       d="m -66.475131,188.33964 c -0.445414,0 -0.874128,-0.16145 -1.208193,-0.45658 l -4.003184,-3.51322 c -0.757206,-0.66811 -0.835154,-1.82622 -0.167033,-2.58339 0.668131,-0.75726 1.826214,-0.83521 2.58342,-0.167 l 2.577856,2.26049 8.602104,-10.53415 c 0.640246,-0.78505 1.792804,-0.8964 2.577838,-0.26168 0.785033,0.64028 0.896402,1.7928 0.26171,2.57784 l -9.810337,12.00402 c -0.311792,0.38419 -0.773897,0.62358 -1.263848,0.66811 -0.05011,0 -0.100222,0.006 -0.150333,0.006 z"
       style="opacity:0.5;fill:url(#paint3_radial-5-6);stroke-width:0.97434962" />
  </g>
  <ellipse
     style="opacity:1;vector-effect:none;fill:none;fill-opacity:1;stroke:#ff1212;stroke-width:0.24403317;stroke-linecap:butt;stroke-linejoin:miter;stroke-miterlimit:4;stroke-dasharray:none;stroke-dashoffset:0;stroke-opacity:1"
     id="path833-1-9"
     cx="1.5709634"
     cy="1.5709635"
     rx="1.4489468"
     ry="1.448947" />
</svg>
