<?xml version="1.0" encoding="UTF-8" standalone="no"?>
<!-- Uploaded to: SVG Repo, www.svgrepo.com, Generator: SVG Repo Mixer Tools -->

<svg
   xmlns:dc="http://purl.org/dc/elements/1.1/"
   xmlns:cc="http://creativecommons.org/ns#"
   xmlns:rdf="http://www.w3.org/1999/02/22-rdf-syntax-ns#"
   xmlns:svg="http://www.w3.org/2000/svg"
   xmlns="http://www.w3.org/2000/svg"
   xmlns:sodipodi="http://sodipodi.sourceforge.net/DTD/sodipodi-0.dtd"
   xmlns:inkscape="http://www.inkscape.org/namespaces/inkscape"
   width="616.40857"
   height="616.4057"
   viewBox="0 0 43.1486 43.148399"
   version="1.1"
   id="svg4"
   sodipodi:docname="objets.svg"
   inkscape:version="0.92.5 (2060ec1f9f, 2020-04-08)"
   style="fill:#000000">
  <metadata
     id="metadata10">
    <rdf:RDF>
      <cc:Work
         rdf:about="">
        <dc:format>image/svg+xml</dc:format>
        <dc:type
           rdf:resource="http://purl.org/dc/dcmitype/StillImage" />
        <dc:title />
      </cc:Work>
    </rdf:RDF>
  </metadata>
  <defs
     id="defs8" />
  <sodipodi:namedview
     pagecolor="#ffffff"
     bordercolor="#666666"
     borderopacity="1"
     objecttolerance="10"
     gridtolerance="10"
     guidetolerance="10"
     inkscape:pageopacity="0"
     inkscape:pageshadow="2"
     inkscape:window-width="1878"
     inkscape:window-height="1031"
     id="namedview6"
     showgrid="false"
     inkscape:zoom="0.834386"
     inkscape:cx="86.591039"
     inkscape:cy="257.48367"
     inkscape:window-x="42"
     inkscape:window-y="25"
     inkscape:window-maximized="1"
     inkscape:current-layer="svg4"
     fit-margin-top="0"
     fit-margin-left="0"
     fit-margin-right="0"
     fit-margin-bottom="0"
     inkscape:snap-page="true" />
  <rect
     style="opacity:1;vector-effect:none;fill:#0000ff;fill-opacity:1;stroke:none;stroke-width:2.49671769;stroke-linecap:round;stroke-linejoin:round;stroke-miterlimit:4;stroke-dasharray:none;stroke-dashoffset:0;stroke-opacity:1"
     id="rect931"
     width="43.148602"
     height="43.148399"
     x="0"
     y="0"
     rx="5.3338976"
     ry="5.3338723" />
  <path
     inkscape:connector-curvature="0"
     style="fill:#ffffff;fill-opacity:1;stroke-width:0.41391161"
     d="M 36.193949,20.495256 24.034344,4.7831012 C 23.474243,4.0593598 22.435439,3.9269536 21.711698,4.4870555 L 7.9635621,15.126709 20.883142,31.820874 l 0.759975,0.982009 13.748136,-10.639653 2.0266,2.618692 -15.057481,11.652955 c -0.723087,0.559595 -1.763052,0.42704 -2.322647,-0.296047 -0.559595,-0.723086 -0.427041,-1.763051 0.296046,-2.322646 L 20.988445,33.309533 20.22847,32.327524 7.3088894,15.633359 5.9995431,16.64666 C 5.2758017,17.206761 5.143395,18.245564 5.703497,18.969306 L 19.383052,36.64548 c 0.839265,1.084465 2.399504,1.283335 3.48397,0.444069 L 38.906513,24.67662 c 0.181017,-0.140089 0.214101,-0.399644 0.07401,-0.580662 -0.140088,-0.181018 -0.399644,-0.2141 -0.580661,-0.07401 l -0.327336,0.253325 -2.026602,-2.618692 c 0.36138,-0.279671 0.427695,-0.799944 0.148024,-1.161324 z m -21.737805,-3.065761 3.928038,-3.039901 c 0.181017,-0.140088 0.440573,-0.107005 0.580661,0.07401 0.140089,0.181018 0.107006,0.440573 -0.07401,0.580661 l -3.928038,3.039901 c -0.181017,0.140089 -0.440573,0.107006 -0.580663,-0.07401 -0.140088,-0.181018 -0.107004,-0.440573 0.07401,-0.580662 z m 9.765945,-0.230465 -6.219394,4.813177 c -0.181018,0.140088 -0.440574,0.107006 -0.580663,-0.07401 -0.140088,-0.181017 -0.107005,-0.440574 0.07401,-0.580663 l 6.219394,-4.813176 c 0.181017,-0.140089 0.440573,-0.107005 0.580662,0.07401 0.140089,0.181017 0.107006,0.440572 -0.07401,0.580661 z m 0.771406,-3.737294 -8.510751,6.586452 c -0.181016,0.140088 -0.440573,0.107005 -0.580661,-0.07401 -0.14009,-0.181017 -0.107006,-0.440573 0.07401,-0.580661 l 8.510751,-6.586453 c 0.181017,-0.140088 0.440573,-0.107006 0.580662,0.07401 0.140088,0.181017 0.107005,0.440574 -0.07401,0.580662 z"
     id="path2-3" />
</svg>
