<?xml version="1.0" encoding="UTF-8" standalone="no"?>
<svg
   xmlns:dc="http://purl.org/dc/elements/1.1/"
   xmlns:cc="http://creativecommons.org/ns#"
   xmlns:rdf="http://www.w3.org/1999/02/22-rdf-syntax-ns#"
   xmlns:svg="http://www.w3.org/2000/svg"
   xmlns="http://www.w3.org/2000/svg"
   xmlns:sodipodi="http://sodipodi.sourceforge.net/DTD/sodipodi-0.dtd"
   xmlns:inkscape="http://www.inkscape.org/namespaces/inkscape"
   width="722.97894"
   height="722.97894"
   viewBox="0 0 21.689368 21.689368"
   version="1.1"
   id="svg9"
   sodipodi:docname="police_couleur.svg"
   inkscape:version="0.92.5 (2060ec1f9f, 2020-04-08)">
  <metadata
     id="metadata15">
    <rdf:RDF>
      <cc:Work
         rdf:about="">
        <dc:format>image/svg+xml</dc:format>
        <dc:type
           rdf:resource="http://purl.org/dc/dcmitype/StillImage" />
        <dc:title>ic_fluent_font_increase_24_filled</dc:title>
      </cc:Work>
    </rdf:RDF>
  </metadata>
  <defs
     id="defs13">
    <filter
       style="color-interpolation-filters:sRGB"
       inkscape:label="Colorize"
       id="filter2327">
      <feColorMatrix
         type="luminanceToAlpha"
         result="colormatrix1"
         id="feColorMatrix2307" />
      <feFlood
         flood-opacity="1"
         flood-color="rgb(0,0,255)"
         result="flood1"
         id="feFlood2309" />
      <feComposite
         in2="colormatrix1"
         operator="out"
         result="composite1"
         id="feComposite2311" />
      <feFlood
         flood-opacity="1"
         flood-color="rgb(255,31,0)"
         result="flood2"
         id="feFlood2313" />
      <feComposite
         in2="colormatrix1"
         result="composite2"
         operator="in"
         id="feComposite2315" />
      <feComposite
         in="composite2"
         in2="composite1"
         k2="1"
         k3="1"
         operator="arithmetic"
         result="composite3"
         id="feComposite2317"
         k1="0"
         k4="0" />
      <feColorMatrix
         in="composite3"
         type="matrix"
         values="2 -1 0 0 0 0 2 -1 0 0 -1 0 2 0 0 0 0 0 1 0 "
         result="colormatrix2"
         id="feColorMatrix2319" />
      <feComposite
         in="colormatrix2"
         in2="composite3"
         operator="arithmetic"
         k2="0"
         result="composite4"
         id="feComposite2321"
         k1="0"
         k3="0"
         k4="0" />
      <feBlend
         in="composite4"
         in2="composite3"
         mode="normal"
         result="blend"
         id="feBlend2323" />
      <feComposite
         in2="SourceGraphic"
         operator="in"
         id="feComposite2325"
         result="fbSourceGraphic" />
      <feColorMatrix
         result="fbSourceGraphicAlpha"
         in="fbSourceGraphic"
         values="0 0 0 -1 0 0 0 0 -1 0 0 0 0 -1 0 0 0 0 1 0"
         id="feColorMatrix2461" />
      <feComposite
         in2="fbSourceGraphic"
         id="feComposite2463"
         operator="arithmetic"
         k1="0"
         k2="1"
         result="composite1"
         in="fbSourceGraphic"
         k3="0"
         k4="0" />
      <feColorMatrix
         id="feColorMatrix2465"
         in="composite1"
         values="1"
         type="saturate"
         result="colormatrix1" />
      <feFlood
         id="feFlood2467"
         flood-opacity="1"
         flood-color="rgb(158,67,0)"
         result="flood1" />
      <feBlend
         in2="colormatrix1"
         id="feBlend2469"
         in="flood1"
         mode="multiply"
         result="blend1" />
      <feBlend
         in2="blend1"
         id="feBlend2471"
         mode="screen"
         result="blend2" />
      <feColorMatrix
         id="feColorMatrix2473"
         in="blend2"
         values="1"
         type="saturate"
         result="colormatrix2" />
      <feComposite
         in2="fbSourceGraphic"
         id="feComposite2475"
         in="colormatrix2"
         operator="in"
         result="composite2" />
    </filter>
    <linearGradient
       id="linearGradient44-4"
       spreadMethod="pad"
       gradientTransform="matrix(59.639065,-241.88989,241.88989,59.639065,-146.44765,344.95736)"
       gradientUnits="userSpaceOnUse"
       y2="0"
       x2="1"
       y1="0"
       x1="0">
      <stop
         id="stop24-7"
         offset="0"
         style="stop-opacity:1;stop-color:#00a13a" />
      <stop
         id="stop26-8"
         offset="0.1671581"
         style="stop-opacity:1;stop-color:#009fe3" />
      <stop
         id="stop28-4"
         offset="0.18538"
         style="stop-opacity:1;stop-color:#009fe3" />
      <stop
         id="stop30-50"
         offset="0.21186675"
         style="stop-opacity:1;stop-color:#009fe3" />
      <stop
         id="stop32-3"
         offset="0.397037"
         style="stop-opacity:1;stop-color:#243882" />
      <stop
         id="stop34-6"
         offset="0.50573223"
         style="stop-opacity:1;stop-color:#243882" />
      <stop
         id="stop36-1"
         offset="0.731945"
         style="stop-opacity:1;stop-color:#e60d72" />
      <stop
         id="stop38-06"
         offset="0.76750046"
         style="stop-opacity:1;stop-color:#e60d72" />
      <stop
         id="stop40-3"
         offset="0.953004"
         style="stop-opacity:1;stop-color:#ffd004" />
      <stop
         id="stop42-20"
         offset="1"
         style="stop-opacity:1;stop-color:#ffd004" />
    </linearGradient>
  </defs>
  <sodipodi:namedview
     pagecolor="#ffffff"
     bordercolor="#666666"
     borderopacity="1"
     objecttolerance="10"
     gridtolerance="10"
     guidetolerance="10"
     inkscape:pageopacity="0"
     inkscape:pageshadow="2"
     inkscape:window-width="1878"
     inkscape:window-height="1031"
     id="namedview11"
     showgrid="false"
     fit-margin-top="0"
     fit-margin-left="0"
     fit-margin-right="0"
     fit-margin-bottom="0"
     inkscape:zoom="0.59"
     inkscape:cx="-94.859228"
     inkscape:cy="311.99637"
     inkscape:window-x="42"
     inkscape:window-y="25"
     inkscape:window-maximized="1"
     inkscape:current-layer="ic_fluent_font_increase_24_filled" />
  <!-- Uploaded to: SVG Repo, www.svgrepo.com, Generator: SVG Repo Mixer Tools -->
  <title
     id="title2">ic_fluent_font_increase_24_filled</title>
  <desc
     id="desc4">Created with Sketch.</desc>
  <g
     id="🔍-Product-Icons"
     style="fill:none;fill-rule:evenodd;stroke:none;stroke-width:1"
     transform="translate(-5.8665205,-0.61968795)">
    <g
       id="ic_fluent_font_increase_24_filled"
       style="fill:#212121;fill-rule:nonzero">
      <g
         aria-label="A"
         transform="matrix(0.75038781,0,0,0.68684075,9.5589183,-1.0416336)"
         style="font-style:normal;font-variant:normal;font-weight:normal;font-stretch:normal;font-size:25.62991905px;line-height:1.25;font-family:'Liberation Sans Narrow';-inkscape-font-specification:'Liberation Sans Narrow';letter-spacing:0px;word-spacing:0px;fill:#fe0000;fill-opacity:1;stroke:none;stroke-width:1.60186994;filter:url(#filter2327)"
         id="text827">
        <path
           d="m 3.8303339,19.157063 q -0.2582389,0 -0.5562068,-0.119187 -0.2979679,-0.119187 -0.2979679,-0.377426 0,-0.377426 0.4171551,-0.973362 0.4171551,-0.6158 0.4171551,-0.814446 0,-0.715122 0.4370195,-0.953497 0.079458,-0.03973 0.2383743,-0.456884 0.1787807,-0.437019 0.417155,-0.993226 Q 5.1413925,13.912828 5.3797668,13.654589 5.916109,13.098383 7.4258129,9.5227678 8.0813423,7.9931994 9.2533492,5.8478307 10.425356,3.702462 10.782917,3.3846296 q 0.476749,-0.1589162 0.576072,-0.1589162 0.317832,0 0.655529,0.1986453 0.337697,0.3972904 1.191871,2.3837429 0.87404,1.966588 0.87404,2.5227948 0.01986,0.3972902 0.377425,1.7878076 0.357562,1.370652 0.496614,2.185098 0.09932,0.754852 0.6158,2.542659 0.516478,1.787807 0.516478,2.244691 0,0.21851 -0.09932,0.317833 -0.09932,0.09932 -0.437019,0.09932 -0.258239,0 -0.734988,-0.218511 -0.317832,-0.158916 -0.496613,-0.417155 -0.158916,-0.258238 -0.238374,-0.536342 -0.05959,-0.278103 -0.258239,-1.072684 -0.178781,-0.794581 -0.39729,-1.549433 l -0.377427,-1.291194 -0.854174,0.09932 q -1.251468,0.158922 -2.7015785,0.258245 l -1.4302458,0.09932 -0.5760712,0.854175 q -1.549433,2.264556 -2.4234721,4.35033 -0.4568841,1.072685 -1.2316005,1.072685 z m 8.3033711,-8.680798 q 0,-0.377426 -0.357561,-1.9069943 -0.337697,-1.549433 -0.595936,-2.1652333 -0.536342,0.7548519 -1.092549,1.926859 -0.5562065,1.1720068 -0.8541743,1.9665886 l -0.2979679,0.794581 1.3110592,-0.07946 q 1.2316,-0.07946 1.549432,-0.158916 0.337697,-0.07946 0.337697,-0.377427 z"
           style="font-style:normal;font-variant:normal;font-weight:bold;font-stretch:normal;font-family:Purisa;-inkscape-font-specification:'Purisa Bold';opacity:1;vector-effect:none;fill:#141414;fill-opacity:1;stroke:none;stroke-width:0.87494075;stroke-linecap:butt;stroke-linejoin:miter;stroke-miterlimit:4;stroke-dasharray:none;stroke-dashoffset:0;stroke-opacity:1"
           id="path875"
           inkscape:connector-curvature="0" />
      </g>
      <g
         id="g2643"
         transform="matrix(0.86111112,0,0,0.86111112,15.564952,16.182128)">
        <rect
           y="-4.1466188"
           x="-6.7536144"
           height="5.4915257"
           width="5.3898306"
           id="rect2596"
           style="opacity:1;vector-effect:none;fill:#141414;fill-opacity:1;stroke:none;stroke-width:0.92145824;stroke-linecap:butt;stroke-linejoin:miter;stroke-miterlimit:4;stroke-dasharray:none;stroke-dashoffset:0;stroke-opacity:1" />
        <rect
           y="-4.1466188"
           x="-1.3637838"
           height="5.4915257"
           width="5.3898306"
           id="rect2596-6"
           style="opacity:1;vector-effect:none;fill:#ff0000;fill-opacity:1;fill-rule:nonzero;stroke:none;stroke-width:0.92145824;stroke-linecap:butt;stroke-linejoin:miter;stroke-miterlimit:4;stroke-dasharray:none;stroke-dashoffset:0;stroke-opacity:1" />
        <rect
           y="-4.1466188"
           x="4.0260468"
           height="5.4915257"
           width="5.3898306"
           id="rect2596-7"
           style="opacity:1;vector-effect:none;fill:#2b00ff;fill-opacity:1;fill-rule:nonzero;stroke:none;stroke-width:0.92145824;stroke-linecap:butt;stroke-linejoin:miter;stroke-miterlimit:4;stroke-dasharray:none;stroke-dashoffset:0;stroke-opacity:1" />
        <rect
           y="1.3449068"
           x="-6.7536144"
           height="5.4915257"
           width="5.3898306"
           id="rect2596-5"
           style="opacity:1;vector-effect:none;fill:#07ff00;fill-opacity:1;fill-rule:nonzero;stroke:none;stroke-width:0.92145824;stroke-linecap:butt;stroke-linejoin:miter;stroke-miterlimit:4;stroke-dasharray:none;stroke-dashoffset:0;stroke-opacity:1" />
        <rect
           y="1.3449068"
           x="-1.3637838"
           height="5.4915257"
           width="5.3898306"
           id="rect2596-3"
           style="opacity:1;vector-effect:none;fill:#f000ff;fill-opacity:1;fill-rule:nonzero;stroke:none;stroke-width:0.92145824;stroke-linecap:butt;stroke-linejoin:miter;stroke-miterlimit:4;stroke-dasharray:none;stroke-dashoffset:0;stroke-opacity:1" />
        <rect
           y="1.3449068"
           x="4.0260468"
           height="5.4915257"
           width="5.3898306"
           id="rect2596-56"
           style="opacity:1;vector-effect:none;fill:#f5ff01;fill-opacity:1;fill-rule:nonzero;stroke:none;stroke-width:0.92145824;stroke-linecap:butt;stroke-linejoin:miter;stroke-miterlimit:4;stroke-dasharray:none;stroke-dashoffset:0;stroke-opacity:1" />
      </g>
    </g>
  </g>
</svg>
