<?xml version="1.0" encoding="UTF-8" standalone="no"?>
<!DOCTYPE svg PUBLIC "-//W3C//DTD SVG 20010904//EN" "http://www.w3.org/TR/2001/REC-SVG-20010904/DTD/svg10.dtd">
<!-- Created with Inkscape (http://www.inkscape.org/) -->
<svg height="60.0000000" id="svg1" inkscape:version="0.37" sodipodi:docbase="/home/danny/flat/scalable/actions" sodipodi:docname="move.svg" sodipodi:version="0.32" version="1.0" width="60.0000000" x="0" xmlns="http://www.w3.org/2000/svg" xmlns:inkscape="http://www.inkscape.org/namespaces/inkscape" xmlns:sodipodi="http://sodipodi.sourceforge.net/DTD/sodipodi-0.dtd" xmlns:xlink="http://www.w3.org/1999/xlink" y="0">
  <metadata>
    <rdf:RDF xmlns:cc="http://web.resource.org/cc/" xmlns:dc="http://purl.org/dc/elements/1.1/" xmlns:rdf="http://www.w3.org/1999/02/22-rdf-syntax-ns#">
      <cc:Work rdf:about="">
        <dc:title>Part of the Flat Icon Collection (Wed Aug 25 23:29:46 2004)</dc:title>
        <dc:description/>
        <dc:subject>
          <rdf:Bag>
            <rdf:li>hash</rdf:li>
            <rdf:li/>
            <rdf:li>action</rdf:li>
            <rdf:li>computer</rdf:li>
            <rdf:li>icons</rdf:li>
            <rdf:li>theme</rdf:li>
          </rdf:Bag>
        </dc:subject>
        <dc:publisher>
          <cc:Agent rdf:about="http://www.openclipart.org/">
            <dc:title>Danny Allen</dc:title>
          </cc:Agent>
        </dc:publisher>
        <dc:creator>
          <cc:Agent>
            <dc:title>Danny Allen</dc:title>
          </cc:Agent>
        </dc:creator>
        <dc:rights>
          <cc:Agent>
            <dc:title>Danny Allen</dc:title>
          </cc:Agent>
        </dc:rights>
        <dc:date/>
        <dc:format>image/svg+xml</dc:format>
        <dc:type rdf:resource="http://purl.org/dc/dcmitype/StillImage"/>
        <cc:license rdf:resource="http://web.resource.org/cc/PublicDomain"/>
        <dc:language>en</dc:language>
      </cc:Work>
      <cc:License rdf:about="http://web.resource.org/cc/PublicDomain">
        <cc:permits rdf:resource="http://web.resource.org/cc/Reproduction"/>
        <cc:permits rdf:resource="http://web.resource.org/cc/Distribution"/>
        <cc:permits rdf:resource="http://web.resource.org/cc/DerivativeWorks"/>
      </cc:License>
    </rdf:RDF>
  </metadata>
  <sodipodi:namedview bordercolor="#666666" borderopacity="1.0" id="base" inkscape:cx="28.3919907" inkscape:cy="27.2342658" inkscape:pageopacity="0.0" inkscape:pageshadow="2" inkscape:window-height="685" inkscape:window-width="1016" inkscape:window-x="0" inkscape:window-y="0" inkscape:zoom="6.94653375" pagecolor="#ffffff"/>
  <defs id="defs3">
    <linearGradient id="linearGradient900">
      <stop id="stop901" offset="0" style="stop-color:#000;stop-opacity:1;"/>
      <stop id="stop902" offset="1" style="stop-color:#fff;stop-opacity:1;"/>
    </linearGradient>
    <linearGradient id="linearGradient903" xlink:href="#linearGradient900"/>
    <linearGradient id="linearGradient904" xlink:href="#linearGradient900"/>
    <linearGradient id="linearGradient905" xlink:href="#linearGradient900"/>
    <linearGradient id="linearGradient906" xlink:href="#linearGradient900"/>
    <linearGradient id="linearGradient907" xlink:href="#linearGradient900"/>
  </defs>
  <path d="M 30.531250 3.000000 L 20.218750 11.906250 L 27.156250 11.906250 L 27.156250 27.500000 L 11.875000 27.500000 L 11.937500 19.968750 L 2.781250 29.250000 L 11.718750 39.562500 L 11.718750 32.593750 L 27.156250 32.593750 L 27.156250 47.625000 L 19.750000 47.625000 L 29.375000 56.968750 L 39.218750 47.593750 L 32.281250 47.593750 L 32.281250 32.593750 L 47.406250 32.593750 L 47.406250 40.031250 L 56.781250 30.406250 L 47.406250 20.531250 L 47.406250 27.500000 L 32.281250 27.500000 L 32.281250 12.062500 L 39.812500 12.156250 L 30.531250 3.000000 z " id="path690" sodipodi:stroke-cmyk="(0 0 0 0.8)" style="fill:#b3b3b3;fill-rule:evenodd;stroke:#333333;stroke-opacity:1;stroke-width:3.125;stroke-linejoin:round;stroke-linecap:round;fill-opacity:1;stroke-dasharray:none;"/>
</svg>