<?xml version="1.0" encoding="UTF-8" standalone="no"?>
<!-- Uploaded to: SVG Repo, www.svgrepo.com, Generator: SVG Repo Mixer Tools -->

<svg
   xmlns:dc="http://purl.org/dc/elements/1.1/"
   xmlns:cc="http://creativecommons.org/ns#"
   xmlns:rdf="http://www.w3.org/1999/02/22-rdf-syntax-ns#"
   xmlns:svg="http://www.w3.org/2000/svg"
   xmlns="http://www.w3.org/2000/svg"
   xmlns:sodipodi="http://sodipodi.sourceforge.net/DTD/sodipodi-0.dtd"
   xmlns:inkscape="http://www.inkscape.org/namespaces/inkscape"
   width="800px"
   height="800px"
   viewBox="0 0 16 16"
   fill="#000000"
   class="bi bi-back"
   version="1.1"
   id="svg4"
   sodipodi:docname="front.svg"
   inkscape:version="0.92.5 (2060ec1f9f, 2020-04-08)">
  <metadata
     id="metadata10">
    <rdf:RDF>
      <cc:Work
         rdf:about="">
        <dc:format>image/svg+xml</dc:format>
        <dc:type
           rdf:resource="http://purl.org/dc/dcmitype/StillImage" />
        <dc:title></dc:title>
      </cc:Work>
    </rdf:RDF>
  </metadata>
  <defs
     id="defs8">
    <radialGradient
       id="paint3_radial"
       cx="0"
       cy="0"
       r="1"
       gradientUnits="userSpaceOnUse"
       gradientTransform="matrix(-8.9060044,4.0932916,-1.7327029,-3.7699389,11.6442,17.0245)">
      <stop
         stop-color="#440063"
         stop-opacity="0.25"
         id="stop45" />
      <stop
         offset="1"
         stop-color="#420061"
         stop-opacity="0"
         id="stop47" />
    </radialGradient>
    <linearGradient
       id="paint0_linear"
       x1="15.825"
       y1="-13.9667"
       x2="9.8253298"
       y2="23.917101"
       gradientUnits="userSpaceOnUse">
      <stop
         stop-color="#00CC00"
         id="stop10" />
      <stop
         offset="0.1878"
         stop-color="#06C102"
         id="stop12" />
      <stop
         offset="0.5185"
         stop-color="#17A306"
         id="stop14" />
      <stop
         offset="0.9507"
         stop-color="#33740C"
         id="stop16" />
      <stop
         offset="1"
         stop-color="#366E0D"
         id="stop18" />
    </linearGradient>
    <linearGradient
       id="paint1_linear"
       x1="15.2501"
       y1="0.62542599"
       x2="7.4344301"
       y2="23.6215"
       gradientUnits="userSpaceOnUse">
      <stop
         offset="0.2544"
         stop-color="#90D856"
         id="stop21" />
      <stop
         offset="0.736"
         stop-color="#00CC00"
         id="stop23" />
      <stop
         offset="0.7716"
         stop-color="#0BCD07"
         id="stop25" />
      <stop
         offset="0.8342"
         stop-color="#29CF18"
         id="stop27" />
      <stop
         offset="0.9166"
         stop-color="#59D335"
         id="stop29" />
      <stop
         offset="1"
         stop-color="#90D856"
         id="stop31" />
    </linearGradient>
    <radialGradient
       id="paint2_radial"
       cx="0"
       cy="0"
       r="1"
       gradientUnits="userSpaceOnUse"
       gradientTransform="matrix(-3.6807044,7.5036369,-3.8454416,-1.8862764,15.452,8.95803)">
      <stop
         stop-color="#FBE07A"
         stop-opacity="0.75"
         id="stop34" />
      <stop
         offset="0.0803394"
         stop-color="#FBE387"
         stop-opacity="0.6897"
         id="stop36" />
      <stop
         offset="0.5173"
         stop-color="#FDF2C7"
         stop-opacity="0.362"
         id="stop38" />
      <stop
         offset="0.8357"
         stop-color="#FFFBF0"
         stop-opacity="0.1233"
         id="stop40" />
      <stop
         offset="1"
         stop-color="white"
         stop-opacity="0"
         id="stop42" />
    </radialGradient>
    <radialGradient
       id="paint3_radial-3"
       cx="0"
       cy="0"
       r="1"
       gradientUnits="userSpaceOnUse"
       gradientTransform="matrix(-8.9060044,4.0932916,-1.7327029,-3.7699389,11.6442,17.0245)">
      <stop
         stop-color="#440063"
         stop-opacity="0.25"
         id="stop45-6" />
      <stop
         offset="1"
         stop-color="#420061"
         stop-opacity="0"
         id="stop47-7" />
    </radialGradient>
  </defs>
  <sodipodi:namedview
     pagecolor="#ffffff"
     bordercolor="#666666"
     borderopacity="1"
     objecttolerance="10"
     gridtolerance="10"
     guidetolerance="10"
     inkscape:pageopacity="0"
     inkscape:pageshadow="2"
     inkscape:window-width="1398"
     inkscape:window-height="851"
     id="namedview6"
     showgrid="false"
     inkscape:zoom="0.417193"
     inkscape:cx="-45.106347"
     inkscape:cy="140.01851"
     inkscape:window-x="42"
     inkscape:window-y="25"
     inkscape:window-maximized="1"
     inkscape:current-layer="svg4" />
  <rect
     style="opacity:1;vector-effect:none;fill:#ccd9ff;fill-opacity:1;stroke:#3e4cde;stroke-width:0.55620557;stroke-linecap:butt;stroke-linejoin:miter;stroke-miterlimit:4;stroke-dasharray:none;stroke-dashoffset:0;stroke-opacity:1"
     id="rect1434-36"
     width="8.6730356"
     height="9.0501251"
     x="5.922523"
     y="0.26383615"
     rx="1"
     ry="1" />
  <rect
     style="opacity:1;vector-effect:none;fill:#e7e5d1;fill-opacity:1;stroke:#3e4cde;stroke-width:0.31717208;stroke-linecap:butt;stroke-linejoin:miter;stroke-miterlimit:4;stroke-dasharray:none;stroke-dashoffset:0;stroke-opacity:1"
     id="rect1434-3"
     width="9.0796595"
     height="9.4744282"
     x="0.16372398"
     y="3.6095603"
     rx="1"
     ry="1" />
  <rect
     style="opacity:1;vector-effect:none;fill:#daf914;fill-opacity:1;stroke:#3e4cde;stroke-width:0.55620557;stroke-linecap:butt;stroke-linejoin:miter;stroke-miterlimit:4;stroke-dasharray:none;stroke-dashoffset:0;stroke-opacity:1"
     id="rect1434"
     width="8.6730356"
     height="9.0501251"
     x="7.07056"
     y="6.6787982"
     rx="1"
     ry="1" />
  <g
     id="g899"
     transform="matrix(0.3829662,0,0,0.3829662,6.7819314,7.1626574)">
    <path
       id="path2"
       d="m 4.91988,12.257 c -0.63428,0 -1.26857,0.2629 -1.72,0.7772 -0.40571,0.4571 -0.60571,1.0457 -0.56571,1.6571 0.04,0.6114 0.31429,1.1657 0.77143,1.5714 l 4.10857,3.6057 c 0.41714,0.3658 0.95429,0.5715 1.50857,0.5715 0.06286,0 0.12572,0 0.18857,-0.0057 0.61715,-0.0515 1.19429,-0.3543 1.58289,-0.8343 L 20.857,7.27986 C 21.657,6.30272 21.5085,4.85701 20.5313,4.05701 20.057,3.67415 19.4627,3.49129 18.857,3.55415 18.2513,3.61701 17.7027,3.90844 17.3142,4.38272 L 8.74846,14.8627 6.42274,12.8227 C 5.99417,12.4456 5.45131,12.257 4.91988,12.257 Z"
       style="fill:url(#paint0_linear)"
       inkscape:connector-curvature="0" />
    <path
       id="path4"
       d="m 9.02279,20.0284 c -0.45714,0 -0.89714,-0.1657 -1.24,-0.4686 L 3.67422,15.9541 C 2.89708,15.2684 2.81708,14.0798 3.50279,13.3027 4.18851,12.5255 5.37708,12.4455 6.15422,13.1313 l 2.64572,2.32 8.82856,-10.81147 c 0.6571,-0.80571 1.84,-0.92 2.6457,-0.26857 0.8057,0.65714 0.92,1.84 0.2686,2.64571 L 10.4742,19.337 c -0.32,0.3943 -0.79427,0.64 -1.29712,0.6857 -0.05143,0 -0.10286,0.0057 -0.15429,0.0057 z"
       style="fill:url(#paint1_linear)"
       inkscape:connector-curvature="0" />
    <path
       id="path6"
       d="m 9.02279,20.0284 c -0.45714,0 -0.89714,-0.1657 -1.24,-0.4686 L 3.67422,15.9541 C 2.89708,15.2684 2.81708,14.0798 3.50279,13.3027 4.18851,12.5255 5.37708,12.4455 6.15422,13.1313 l 2.64572,2.32 8.82856,-10.81147 c 0.6571,-0.80571 1.84,-0.92 2.6457,-0.26857 0.8057,0.65714 0.92,1.84 0.2686,2.64571 L 10.4742,19.337 c -0.32,0.3943 -0.79427,0.64 -1.29712,0.6857 -0.05143,0 -0.10286,0.0057 -0.15429,0.0057 z"
       style="opacity:0.75;fill:url(#paint2_radial)"
       inkscape:connector-curvature="0" />
    <g
       id="g879">
      <path
         d="m 9.02279,20.0284 c -0.45714,0 -0.89714,-0.1657 -1.24,-0.4686 L 3.67422,15.9541 C 2.89708,15.2684 2.81708,14.0798 3.50279,13.3027 4.18851,12.5255 5.37708,12.4455 6.15422,13.1313 l 2.64572,2.32 8.82856,-10.81147 c 0.6571,-0.80571 1.84,-0.92 2.6457,-0.26857 0.8057,0.65714 0.92,1.84 0.2686,2.64571 L 10.4742,19.337 c -0.32,0.3943 -0.79427,0.64 -1.29712,0.6857 -0.05143,0 -0.10286,0.0057 -0.15429,0.0057 z"
         id="path8"
         style="opacity:0.5;fill:url(#paint3_radial-3)"
         inkscape:connector-curvature="0" />
    </g>
  </g>
  <path
     style="opacity:1;vector-effect:none;fill:#ffe300;fill-opacity:1;stroke:#ff1800;stroke-width:1.03297138;stroke-linecap:butt;stroke-linejoin:miter;stroke-miterlimit:4;stroke-dasharray:none;stroke-dashoffset:0;stroke-opacity:1"
     d="M 5.857699,1.9876905 C 4.486488,3.1107457 3.493743,3.9043895 3.90569,5.5269443 4.020259,6.1953276 6.4302519,7.936628 6.6882487,8.555779 6.8092742,8.9544727 6.216255,9.1200565 5.922523,9.313961 5.763242,9.377121 5.450293,9.584903 5.742297,9.684788 c 1.4197488,0.442157 2.8866703,0.773306 4.338604,1.132046 0.242295,-0.0613 0.104876,-0.378879 0.181561,-0.543526 C 10.395478,9.1210021 10.535978,7.9661928 10.642735,6.8137247 10.482636,6.6440663 10.236298,6.9116407 10.07579,6.9647981 9.7537413,7.1198455 9.3501063,7.4889355 8.9645293,7.2421314 8.5381963,6.905181 6.6951037,5.2913312 6.4830194,4.8490374 6.031553,3.7204228 7.4364024,2.2591181 7.5903134,1.0885153 c 0.01734,-0.09102 -0.265572,-0.07136 -0.397797,0.013458 z"
     id="path839"
     inkscape:connector-curvature="0"
     sodipodi:nodetypes="cccccccccccccc" />
</svg>
