<?xml version="1.0" encoding="UTF-8" standalone="no"?>
<svg
   xmlns:dc="http://purl.org/dc/elements/1.1/"
   xmlns:cc="http://creativecommons.org/ns#"
   xmlns:rdf="http://www.w3.org/1999/02/22-rdf-syntax-ns#"
   xmlns:svg="http://www.w3.org/2000/svg"
   xmlns="http://www.w3.org/2000/svg"
   xmlns:sodipodi="http://sodipodi.sourceforge.net/DTD/sodipodi-0.dtd"
   xmlns:inkscape="http://www.inkscape.org/namespaces/inkscape"
   width="464.1243"
   height="722.97894"
   viewBox="0 0 13.923729 21.689368"
   version="1.1"
   id="svg9"
   sodipodi:docname="fond_couleur.svg"
   inkscape:version="0.92.5 (2060ec1f9f, 2020-04-08)">
  <metadata
     id="metadata15">
    <rdf:RDF>
      <cc:Work
         rdf:about="">
        <dc:format>image/svg+xml</dc:format>
        <dc:type
           rdf:resource="http://purl.org/dc/dcmitype/StillImage" />
        <dc:title>ic_fluent_font_increase_24_filled</dc:title>
      </cc:Work>
    </rdf:RDF>
  </metadata>
  <defs
     id="defs13">
    <filter
       style="color-interpolation-filters:sRGB"
       inkscape:label="Colorize"
       id="filter2327">
      <feColorMatrix
         type="luminanceToAlpha"
         result="colormatrix1"
         id="feColorMatrix2307" />
      <feFlood
         flood-opacity="1"
         flood-color="rgb(0,0,255)"
         result="flood1"
         id="feFlood2309" />
      <feComposite
         in2="colormatrix1"
         operator="out"
         result="composite1"
         id="feComposite2311" />
      <feFlood
         flood-opacity="1"
         flood-color="rgb(255,31,0)"
         result="flood2"
         id="feFlood2313" />
      <feComposite
         in2="colormatrix1"
         result="composite2"
         operator="in"
         id="feComposite2315" />
      <feComposite
         in="composite2"
         in2="composite1"
         k2="1"
         k3="1"
         operator="arithmetic"
         result="composite3"
         id="feComposite2317"
         k1="0"
         k4="0" />
      <feColorMatrix
         in="composite3"
         type="matrix"
         values="2 -1 0 0 0 0 2 -1 0 0 -1 0 2 0 0 0 0 0 1 0 "
         result="colormatrix2"
         id="feColorMatrix2319" />
      <feComposite
         in="colormatrix2"
         in2="composite3"
         operator="arithmetic"
         k2="0"
         result="composite4"
         id="feComposite2321"
         k1="0"
         k3="0"
         k4="0" />
      <feBlend
         in="composite4"
         in2="composite3"
         mode="normal"
         result="blend"
         id="feBlend2323" />
      <feComposite
         in2="SourceGraphic"
         operator="in"
         id="feComposite2325"
         result="fbSourceGraphic" />
      <feColorMatrix
         result="fbSourceGraphicAlpha"
         in="fbSourceGraphic"
         values="0 0 0 -1 0 0 0 0 -1 0 0 0 0 -1 0 0 0 0 1 0"
         id="feColorMatrix2461" />
      <feComposite
         in2="fbSourceGraphic"
         id="feComposite2463"
         operator="arithmetic"
         k1="0"
         k2="1"
         result="composite1"
         in="fbSourceGraphic"
         k3="0"
         k4="0" />
      <feColorMatrix
         id="feColorMatrix2465"
         in="composite1"
         values="1"
         type="saturate"
         result="colormatrix1" />
      <feFlood
         id="feFlood2467"
         flood-opacity="1"
         flood-color="rgb(158,67,0)"
         result="flood1" />
      <feBlend
         in2="colormatrix1"
         id="feBlend2469"
         in="flood1"
         mode="multiply"
         result="blend1" />
      <feBlend
         in2="blend1"
         id="feBlend2471"
         mode="screen"
         result="blend2" />
      <feColorMatrix
         id="feColorMatrix2473"
         in="blend2"
         values="1"
         type="saturate"
         result="colormatrix2" />
      <feComposite
         in2="fbSourceGraphic"
         id="feComposite2475"
         in="colormatrix2"
         operator="in"
         result="composite2" />
    </filter>
    <linearGradient
       id="linearGradient44-4"
       spreadMethod="pad"
       gradientTransform="matrix(59.639065,-241.88989,241.88989,59.639065,-146.44765,344.95736)"
       gradientUnits="userSpaceOnUse"
       y2="0"
       x2="1"
       y1="0"
       x1="0">
      <stop
         id="stop24-7"
         offset="0"
         style="stop-opacity:1;stop-color:#00a13a" />
      <stop
         id="stop26-8"
         offset="0.1671581"
         style="stop-opacity:1;stop-color:#009fe3" />
      <stop
         id="stop28-4"
         offset="0.18538"
         style="stop-opacity:1;stop-color:#009fe3" />
      <stop
         id="stop30-50"
         offset="0.21186675"
         style="stop-opacity:1;stop-color:#009fe3" />
      <stop
         id="stop32-3"
         offset="0.397037"
         style="stop-opacity:1;stop-color:#243882" />
      <stop
         id="stop34-6"
         offset="0.50573223"
         style="stop-opacity:1;stop-color:#243882" />
      <stop
         id="stop36-1"
         offset="0.731945"
         style="stop-opacity:1;stop-color:#e60d72" />
      <stop
         id="stop38-06"
         offset="0.76750046"
         style="stop-opacity:1;stop-color:#e60d72" />
      <stop
         id="stop40-3"
         offset="0.953004"
         style="stop-opacity:1;stop-color:#ffd004" />
      <stop
         id="stop42-20"
         offset="1"
         style="stop-opacity:1;stop-color:#ffd004" />
    </linearGradient>
  </defs>
  <sodipodi:namedview
     pagecolor="#ffffff"
     bordercolor="#666666"
     borderopacity="1"
     objecttolerance="10"
     gridtolerance="10"
     guidetolerance="10"
     inkscape:pageopacity="0"
     inkscape:pageshadow="2"
     inkscape:window-width="1878"
     inkscape:window-height="1031"
     id="namedview11"
     showgrid="false"
     fit-margin-top="0"
     fit-margin-left="0"
     fit-margin-right="0"
     fit-margin-bottom="0"
     inkscape:zoom="0.59"
     inkscape:cx="248.05643"
     inkscape:cy="354.57775"
     inkscape:window-x="42"
     inkscape:window-y="25"
     inkscape:window-maximized="1"
     inkscape:current-layer="ic_fluent_font_increase_24_filled" />
  <!-- Uploaded to: SVG Repo, www.svgrepo.com, Generator: SVG Repo Mixer Tools -->
  <title
     id="title2">ic_fluent_font_increase_24_filled</title>
  <desc
     id="desc4">Created with Sketch.</desc>
  <g
     id="🔍-Product-Icons"
     style="fill:none;fill-rule:evenodd;stroke:none;stroke-width:1"
     transform="translate(-5.8665205,-0.61968777)">
    <g
       id="ic_fluent_font_increase_24_filled"
       style="fill:#212121;fill-rule:nonzero">
      <g
         id="g2643"
         transform="matrix(0.86111112,0,0,1.9722222,11.682133,8.8260923)">
        <rect
           y="-4.1466188"
           x="-6.7536144"
           height="5.4915257"
           width="5.3898306"
           id="rect2596"
           style="opacity:1;vector-effect:none;fill:#141414;fill-opacity:1;stroke:none;stroke-width:0.92145824;stroke-linecap:butt;stroke-linejoin:miter;stroke-miterlimit:4;stroke-dasharray:none;stroke-dashoffset:0;stroke-opacity:1" />
        <rect
           y="-4.1466188"
           x="-1.3637838"
           height="5.4915257"
           width="5.3898306"
           id="rect2596-6"
           style="opacity:1;vector-effect:none;fill:#ff0000;fill-opacity:1;fill-rule:nonzero;stroke:none;stroke-width:0.92145824;stroke-linecap:butt;stroke-linejoin:miter;stroke-miterlimit:4;stroke-dasharray:none;stroke-dashoffset:0;stroke-opacity:1" />
        <rect
           y="-4.1466188"
           x="4.0260468"
           height="5.4915257"
           width="5.3898306"
           id="rect2596-7"
           style="opacity:1;vector-effect:none;fill:#2b00ff;fill-opacity:1;fill-rule:nonzero;stroke:none;stroke-width:0.92145824;stroke-linecap:butt;stroke-linejoin:miter;stroke-miterlimit:4;stroke-dasharray:none;stroke-dashoffset:0;stroke-opacity:1" />
        <rect
           y="1.3449068"
           x="-6.7536144"
           height="5.4915257"
           width="5.3898306"
           id="rect2596-5"
           style="opacity:1;vector-effect:none;fill:#07ff00;fill-opacity:1;fill-rule:nonzero;stroke:none;stroke-width:0.92145824;stroke-linecap:butt;stroke-linejoin:miter;stroke-miterlimit:4;stroke-dasharray:none;stroke-dashoffset:0;stroke-opacity:1" />
        <rect
           y="1.3449068"
           x="-1.3637838"
           height="5.4915257"
           width="5.3898306"
           id="rect2596-3"
           style="opacity:1;vector-effect:none;fill:#f000ff;fill-opacity:1;fill-rule:nonzero;stroke:none;stroke-width:0.92145824;stroke-linecap:butt;stroke-linejoin:miter;stroke-miterlimit:4;stroke-dasharray:none;stroke-dashoffset:0;stroke-opacity:1" />
        <rect
           y="1.3449068"
           x="4.0260468"
           height="5.4915257"
           width="5.3898306"
           id="rect2596-56"
           style="opacity:1;vector-effect:none;fill:#f5ff01;fill-opacity:1;fill-rule:nonzero;stroke:none;stroke-width:0.92145824;stroke-linecap:butt;stroke-linejoin:miter;stroke-miterlimit:4;stroke-dasharray:none;stroke-dashoffset:0;stroke-opacity:1" />
      </g>
    </g>
  </g>
</svg>
