<?xml version="1.0" encoding="UTF-8" standalone="no"?>
<svg
   xmlns:dc="http://purl.org/dc/elements/1.1/"
   xmlns:cc="http://creativecommons.org/ns#"
   xmlns:rdf="http://www.w3.org/1999/02/22-rdf-syntax-ns#"
   xmlns:svg="http://www.w3.org/2000/svg"
   xmlns="http://www.w3.org/2000/svg"
   width="100%"
   height="100%"
   viewBox="0 0 196.15592 132.82368"
   version="1.1"
   id="svg8">
  <defs
     id="defs2" />
  <metadata
     id="metadata5">
    <rdf:RDF>
      <cc:Work
         rdf:about="">
        <dc:format>image/svg+xml</dc:format>
        <dc:type
           rdf:resource="http://purl.org/dc/dcmitype/StillImage" />
        <dc:title></dc:title>
      </cc:Work>
    </rdf:RDF>
  </metadata>
  <g
     style="fill:#ffffff;stroke-width:2.64583329;stroke-miterlimit:4;stroke-dasharray:none;fill-opacity:1"
     id="layer1"
     transform="translate(-14.715046,-82.019683)">
    <path
       style="fill:#ffffff;fill-opacity:1;stroke:#000000;stroke-width:2.64583329;stroke-linecap:butt;stroke-linejoin:miter;stroke-miterlimit:4;stroke-dasharray:none;stroke-opacity:1"
       d="m 47.601676,168.70987 -25.985629,-32.38251 27.9385,5.29305 L 25.634367,91.3506 54.353,111.6933 68.41369,95.538688 78.619047,108.38988 97.895832,87.979164 l 12.095238,28.726186 37.41964,-23.812495 3.77976,19.654765 44.60119,-9.82738 -7.9375,18.52083 17.76489,20.41071 -21.37839,16.55539 22.13434,23.51009 -22.58789,-1.30787 1.65332,30.59424 -17.99698,-18.70304 -12.47321,17.00893 -9.44941,-12.47321 -13.63697,14.02144 -7.90767,-18.55716 -10.26176,17.33376 L 97.517856,191.92262 85.654719,211.17933 67.044408,193.84882 27.162165,210.48627 45.87595,184.52728 21.621114,166.71751 Z"
       id="path815" />
  </g>
</svg>
