<?xml version="1.0" encoding="UTF-8" standalone="no"?>
<svg
   xmlns:svg="http://www.w3.org/2000/svg"
   xmlns="http://www.w3.org/2000/svg"
   width="72.96804mm"
   height="18.732918mm"
   viewBox="0 0 72.96804 18.732918"
   version="1.1">
  <g
     transform="translate(-31.438988,-21.648776)"
     style="fill:#232323;fill-opacity:0;stroke:#333333;stroke-width:0.2px;stroke-linecap:round;stroke-linejoin:round;stroke-opacity:1">
    <path
        d="m 31.938988,39.881695 v -1.364258 h 0.909505 V 27.59304 h 0.909505 v -0.454753 h -0.909505 v -0.454753 h 1.364258 v 1.364258 h -0.909505 v 4.096219 h 0.454752 v -3.641466 h 0.454753 v 4.096218 h -0.909505 v 1.367703 h 0.454752 v -0.909505 h 0.454753 v 1.364258 H 33.303246 V 38.97219 H 32.39374 v 0.454752 h 7.737685 V 38.97219 h -2.731961 v -0.454753 h 3.641466 v 0.454753 h -0.454753 v 0.909505 z m 1.81901,-0.909505 v -2.273763 h 0.454753 v 1.81901 h 2.277208 v -0.454753 h -1.822456 v -1.822455 h -0.909505 v -1.364258 h 0.454753 v 0.909505 h 0.454752 V 26.228782 H 32.39374 v 11.833902 h -0.454752 v -12.2921 h 3.183268 v 10.927843 h 5.463921 v 0.909505 h 0.454753 v 0.454752 h -0.909505 v -0.909505 h -0.454753 v 0.909505 h -2.277208 v -0.454752 h 1.822455 v -0.454753 h -4.099663 v 0.454753 h 1.822455 v 1.364258 z" />
    <path
        d="m 46.494516,31.234505 v -2.277208 h -2.277208 v 2.277208 z m -5.460477,8.64719 v -1.364258 h 1.819011 v -0.454753 h -0.909505 v -0.454752 h 0.909505 v -5.009169 h -0.454753 v 0.91295 H 41.943545 V 30.325 h 1.364257 v 1.364258 H 42.85305 v -0.909505 h -0.454753 v 1.364258 h 0.909505 v 0.91295 h 2.731961 v 0.454752 h -2.731961 v 5.460477 h -1.81901 v 0.454752 h 2.273763 v -5.460476 h 3.186713 v 2.731961 h 0.909505 v 0.454752 h -0.909505 v 2.273763 h 2.277208 V 38.97219 h -1.822455 v -1.364258 h 0.91295 v -1.367703 h -0.91295 v -2.728516 h -0.909505 v -0.91295 H 43.762555 V 29.870248 H 42.85305 V 27.59304 h 2.277208 v 0.454752 h -1.822456 v 1.367703 h 0.454753 v -0.91295 h 4.554416 V 28.047792 H 45.58501 V 27.59304 h 0.909506 v -0.454753 h -2.731961 v -0.454753 h 3.186713 v 0.909506 h 1.822456 v 5.005723 h -1.367703 v -0.454752 h 0.91295 v -3.186714 h -0.458198 v 0.912951 h -0.454752 v -0.912951 h -0.454753 v 2.277208 h 0.454753 V 30.325 h 0.454752 v 1.364258 h -3.641465 v 0.454753 h 2.73196 v 0.91295 h 0.909505 v 2.728515 h 0.458198 v -1.81901 h 0.454753 v 4.096218 h -0.912951 v 0.454753 h 2.277208 v 0.454753 h -0.454752 v 0.909505 h -3.186713 v -5.460476 h -2.277208 v 5.460476 z m 0,-1.819011 v -11.37915 h 0.909506 v -0.91295 h 6.828179 v 0.91295 h 0.909505 v 10.924398 h 0.454752 v 0.454752 h -0.909505 v -4.550971 h -0.909505 v -0.454752 h 0.909505 v -5.918674 h -0.909505 v -0.909505 h -0.458198 v 0.909505 h -0.454752 v -0.909505 h -5.005724 v 0.454752 h 0.909505 v 0.454753 h -1.81901 v 2.277208 h 0.454753 V 27.59304 h 0.454752 v 2.277208 h -0.909505 v 5.915228 h 0.454753 v -1.81901 h 0.454752 v 3.186713 h -0.454752 v -0.91295 h -0.454753 v 1.822455 z" />
    <path
        d="m 55.617129,36.698427 v -2.277208 h -2.277208 v 2.277208 z m 0,-5.463922 v -2.277208 h -2.277208 v 2.277208 z m -5.460477,8.64719 v -1.364258 h 1.364258 v 0.454753 h -0.909505 v 0.454752 h 2.273763 V 38.97219 h -0.909505 v -0.454753 h 0.909505 V 34.421219 H 51.52091 v 1.81901 h -0.454752 v -3.183268 h 0.454752 v 0.909505 h 2.277208 v -0.909505 h 0.454753 v 0.909505 h 1.364258 v -1.367703 h -0.454753 v 0.91295 h -0.454753 v -0.91295 h -1.822455 v -3.641466 h -0.454753 v 0.912951 H 51.066158 V 27.59304 h 0.454752 v 1.822455 h 0.454753 v -0.91295 h 3.641466 v -0.454753 h -3.641466 v -1.364258 h 1.364258 v 0.454753 h -0.909506 v 0.454753 h 4.550971 V 30.325 h 0.458198 v -1.822455 h 0.454753 v 2.277208 h -1.367703 v -2.731961 h -0.454753 v 3.186713 h 1.822456 v 0.454753 h -4.554416 v 0.454753 h 2.73196 v 4.554416 h 1.367703 v -0.458198 h -0.91295 v -0.454753 h 1.367703 v 1.367703 h -4.554416 v 2.273763 h 4.099663 V 38.97219 h -3.641466 v -1.364258 h 2.273763 v 0.454752 h -1.81901 v 0.454753 h 5.005723 v 0.454753 h -1.364257 v 0.909505 z m 0,-1.819011 v -12.2921 h 7.737685 v 0.91295 h 0.909505 v 5.915229 h -0.909505 v 0.458198 h 0.909505 v 4.550971 h 0.454752 v 0.454752 h -2.73196 v -0.454752 h 1.822455 v -2.277208 h -1.822455 v -2.273763 h 0.454752 v 1.81901 h 1.367703 v -0.454752 h -0.909505 v -0.454753 h 0.909505 v -0.454753 h -0.909505 v -0.91295 h -0.91295 v -0.454752 h 1.822455 v -5.005724 h -0.454752 v 0.909505 h -0.454753 v -1.81901 h -3.186713 v 0.454752 h 2.728515 v 0.454753 H 53.798118 V 26.228782 H 51.52091 v 0.909505 h -0.454752 v -0.909505 h -0.454753 v 5.005723 h 0.454753 V 30.325 h 1.364257 v 1.364258 H 51.975663 V 30.779753 H 51.52091 v 0.909505 h -0.909505 v 0.454753 h 1.81901 v 0.91295 h 0.909506 v 0.454752 h -1.364258 v -0.91295 h -1.364258 v 5.009169 h 1.364258 v -0.454753 h -0.909505 v -0.454752 h 0.909505 v -1.822456 h 0.454752 v 3.186713 z" />
    <path
        d="m 59.251705,39.881695 v -1.364258 h 1.364258 v 0.454753 h -0.909505 v 0.454752 h 2.273763 V 38.97219 H 61.070716 V 35.330724 H 60.16121 v -8.64719 h 0.454753 v 1.819011 h 0.454753 v -1.819011 h 0.454752 v 4.096219 h -0.454752 v -1.822456 h -0.454753 v 5.918674 h 0.454753 v -3.641466 h 0.454752 v 7.282932 h 1.367703 v 0.454753 h -0.458198 v 0.909505 z m 0,-1.819011 v -12.2921 h 3.183268 v 11.837348 h 0.458198 v 0.454752 h -0.91295 V 26.228782 h -2.273763 v 9.556694 h 0.909505 v 2.277208 H 60.16121 v -1.822455 h -0.454752 v 1.822455 z" />
    <path
        d="m 68.350201,31.234505 v -2.277208 h -2.277208 v 2.277208 z m -5.460476,8.64719 v -1.364258 h 0.454752 v 0.909505 h 2.273763 v -5.005723 h -1.364257 v 1.81901 H 63.79923 V 27.59304 h 3.186713 v 0.454752 h -2.73196 v 5.918674 h 4.550971 v 5.460476 h 1.367702 v -5.460476 h 0.454753 v 5.460476 h 0.454753 v -0.909505 h 0.909505 v 0.454753 h -0.454753 v 0.909505 h -3.186713 v -5.460476 h -2.277208 v 5.460476 z M 63.79923,38.97219 v -0.454753 h 0.909505 v -1.364258 h -1.364258 v 0.454753 h 0.909506 v 0.454752 h -1.364258 v -12.2921 h 7.737684 v 0.91295 h 0.909505 v 5.915229 h -0.909505 v 0.458198 h 0.909505 v 4.550971 h 0.454753 v 0.454752 h -0.909505 v -4.550971 h -0.909506 v -1.367702 h 0.909506 v -4.096219 h -0.454753 v 3.641466 h -0.91295 V 38.97219 H 69.259706 V 30.325 h 0.454753 v 0.909505 h 0.458197 V 27.59304 h 0.909506 v -0.454753 h -1.367703 v 1.81901 h -0.909505 v 0.458198 h 0.909505 v 0.454753 h -0.909505 v 1.81901 h -3.641466 v 0.454753 h 3.641466 v 1.367702 h -4.096219 v -0.454752 h 3.641466 v -0.458198 h -3.641466 v -4.096218 h 0.454753 v 2.73196 h 0.454752 v -2.73196 h 3.641466 v -1.819011 h 0.91295 v -0.454752 h -6.828179 v 0.454752 h 5.460477 v 0.454753 h -0.909506 v 0.454753 h 0.909506 v 0.454752 h -1.364258 v -0.909505 h -4.096219 v 9.56014 h 1.364258 v -1.822456 h 0.454753 v 4.096219 z" />
    <path
        d="m 72.012337,39.881695 v -1.364258 h 1.364258 v 0.454753 h -0.909506 v 0.454752 h 2.273763 V 38.97219 h -0.909505 v -3.641466 h -0.909505 v -8.64719 h 0.454753 v 1.819011 h 0.454752 V 26.683534 H 74.2861 v 4.096219 h -0.454753 v -1.822456 h -0.454752 v 5.918674 h 0.454752 V 31.234505 H 74.2861 v 7.282932 h 1.367703 v 0.454753 h -0.458198 v 0.909505 z m 0,-1.819011 v -12.2921 h 3.183268 v 11.837348 h 0.458198 v 0.454752 H 74.740852 V 26.228782 h -2.273763 v 9.556694 h 0.909506 v 2.277208 h -0.454753 v -1.822455 h -0.454753 v 1.822455 z" />
    <path
        d="m 75.65036,39.881695 v -1.364258 h 0.454753 v 0.909505 h 2.273763 v -5.005723 h -1.364258 v 1.81901 h -0.454753 v -3.183268 h 1.364258 v 0.454752 h -0.909505 v 0.454753 h 1.364258 v -1.367703 h -1.819011 v -0.454752 h 1.819011 v -2.728516 h 2.277208 v 0.454753 H 78.833628 V 30.325 h 3.641466 v 1.819011 h 0.458198 V 27.59304 h 1.364258 v 2.277208 h -0.454753 v -1.822456 h -0.454753 v 4.096219 h 0.909506 v 0.454752 h -2.277209 v -1.81901 h -2.273762 v 0.454752 h 1.81901 v 0.454753 h -0.909505 v 0.454753 h 0.909505 v 0.91295 h 2.731961 v 0.454752 h -1.822456 v 5.915229 h 2.277208 V 38.97219 h -1.81901 v -1.364258 h 0.909505 v -3.186713 h -0.454753 v 2.73196 h -0.454752 v -3.186713 h 1.364258 v 4.096218 h -0.909506 v 0.454753 h 2.273763 v 0.454753 h -0.454752 v 0.909505 h -3.186714 v -6.369982 h -0.909505 v -0.91295 h -0.909505 v -0.909505 h -0.909505 v -0.909505 h -0.458198 v 9.101942 z m 0.909505,-0.909505 v -0.454753 h 0.909505 v -1.364258 h -1.364257 v 0.454753 h 0.909505 v 0.454752 H 75.65036 v -12.2921 h 3.183268 v 0.91295 h 0.912951 v 0.909506 h 0.909505 v 0.909505 h 0.909505 v 0.91295 h 0.454752 v -3.644911 h 3.186714 v 11.837348 h 0.454752 v 0.454752 h -0.909505 v -6.373426 h -0.909505 v -0.454753 h 0.909505 V 30.779753 H 83.842797 V 30.325 h 0.909505 v -4.096218 h -2.277208 v 0.454752 h 1.822456 v 0.454753 h -1.822456 v 2.731961 h -1.364258 v -0.912951 h -0.909505 v -0.909505 h -3.641466 v -1.364258 h 1.364258 v 0.454753 h -0.909505 v 0.454753 h 2.277208 v -0.454753 h -0.91295 v -0.909505 h -2.273763 v 3.186713 h 0.454752 v -0.91295 h 3.186714 v 0.454752 h -1.822456 v 2.731961 h -1.364258 v -0.454753 h 0.909505 v -2.277208 h -0.454752 v 0.912951 H 76.105113 V 30.325 h 0.909505 v 0.454753 h -0.909505 v 5.918674 h 1.364257 v -1.822456 h 0.454753 v 4.096219 z" />
    <path
        d="M 88.410992,39.881695 V 38.97219 h -2.728516 v -0.454753 h 4.550971 v -3.186713 h -0.909505 v -1.364258 h 0.454752 v 0.909505 h 0.454753 V 33.966466 H 90.6882 v 5.005724 h -1.822456 v 0.454752 h 2.277208 v -7.737684 h -1.364258 v 1.367703 h 0.454753 v -0.91295 H 90.6882 v 1.367702 h -1.364258 v -4.096218 h 0.454752 v 1.81901 h 1.364258 v -4.550971 h 0.454753 v 1.819011 h 1.822455 v 10.014892 h 1.364258 v 0.454753 h -1.81901 V 28.957297 h -1.367703 v 10.924398 z m -2.728516,-1.819011 v -0.454752 h 2.728516 v -8.650635 h -2.728516 v -3.186713 h 8.647189 v 11.837348 h 0.454753 v 0.454752 H 93.874913 V 27.138287 H 92.50721 v 0.454753 h 0.91295 v 0.454752 h -1.367703 v -1.364258 h 1.822456 v -0.454752 h -6.828179 v 0.454752 h 0.909505 v 0.454753 h -0.909505 v 0.454753 h 3.186713 V 27.138287 H 88.410992 V 26.683534 H 90.6882 v 4.096219 h -0.454753 v -2.731961 h -3.641466 v -1.81901 h -0.454752 v 2.273763 h 3.641465 v 0.454752 h -0.91295 v 8.650635 h 0.458198 v -1.822456 h 0.454752 v 2.277208 z" />
    <path
        d="m 100.26556,36.698427 v -7.74113 h -2.277204 v 7.74113 z m -4.550967,3.183268 V 38.97219 h -0.909505 v -0.454753 h 1.81901 v -3.186713 h -0.909505 v -3.186713 h 0.454753 v 2.73196 h 0.454752 v -2.73196 h 0.454753 v 3.641465 h 0.454753 v -5.005723 h -0.454753 v 0.909505 h -0.454753 v -3.186713 h 0.454753 V 30.325 h 0.454753 v -1.822455 h 3.641466 v -1.364258 h -2.273764 v 0.454753 h 1.819014 v 0.454752 H 96.624098 V 27.59304 h 1.822456 v -0.454753 h -1.822456 v -0.454753 h 5.005722 v 4.096219 h -0.45475 v -1.822456 h -0.45475 v 9.105387 h -0.45476 v -0.909505 h -2.731956 v -0.91295 h -0.454753 v 2.731961 h -0.909505 v 0.454752 h 5.918674 v -0.909505 h 1.81901 v 0.454753 h -1.36426 v 0.909505 z m 1.819011,-0.909505 v -1.364258 h 2.277208 v 0.909505 h 1.364258 v -6.373426 h 0.91295 v -0.454753 h -0.91295 v -0.454753 h 1.3677 v 2.731961 h 0.45475 v -3.186713 h -0.9095 v -2.277208 h 0.45475 V 30.325 h 0.45475 v -2.277208 h -0.9095 V 27.59304 h 0.9095 v -0.454753 h -0.9095 v -0.909505 h -5.918674 v 0.909505 h -0.909505 v 0.454753 h 0.909505 v 0.454752 h -0.909505 v 0.454753 h 0.909505 v 3.186713 h -0.454753 v -2.731961 h -0.454752 v 8.650635 h 0.454752 v -1.822456 h 0.454753 v 2.277208 h -1.364258 v -11.37915 h 0.909505 v -0.91295 h 6.828177 v 0.91295 h 0.90951 v 10.924398 h 0.45475 v 0.454752 h -0.90951 v -0.909505 h -0.45475 v 0.909505 h -0.45475 v -3.186713 h 0.45475 v 1.822456 h 0.45475 v -2.277208 h -0.9095 v -1.822456 h -0.4582 v 6.373427 h -2.273761 v -0.909506 h -0.454753 v 0.909506 h -0.454752 v -0.909506 h -0.458198 v 0.909506 z" />
    <path
        d="m 59.253498,25.346811 v -1.364257 h 0.909505 v -0.909506 h 0.454753 v 0.909506 h 0.909505 v 0.454752 h -1.81901 v 0.454753 h 2.273763 v -0.909505 h 0.91295 v 0.454752 h -0.458198 v 0.909505 z m 0,-1.81901 v -1.364258 h 3.183268 v 0.909505 h 0.458198 v 0.454753 h -1.822456 v -0.454753 h 0.909506 v -0.454752 h -2.273763 v 0.909505 z" />
    <path
        d="m 72.02301,25.332045 v -1.364258 h 0.909505 v -0.909505 h 0.454753 v 0.909505 h 0.909505 v 0.454752 h -1.81901 v 0.454753 h 2.273763 v -0.909505 h 0.91295 v 0.454752 h -0.458198 v 0.909506 z m 0,-1.819011 v -1.364258 h 3.183268 v 0.909506 h 0.458198 v 0.454752 h -1.822455 v -0.454752 h 0.909505 v -0.454753 h -2.273763 v 0.909505 z" />
  </g>
</svg>
