<?xml version="1.0" encoding="utf-8"?>
<!-- Generator: Adobe Illustrator 28.0.0, SVG Export Plug-In . SVG Version: 6.00 Build 0)  -->
<svg version="1.1" id="Layer_1" xmlns="http://www.w3.org/2000/svg" xmlns:xlink="http://www.w3.org/1999/xlink" x="0px" y="0px"
	 viewBox="0 0 112.5 112.5" style="enable-background:new 0 0 112.5 112.5;" xml:space="preserve">
<style type="text/css">
	.st0{fill:#FFFFFF;}
</style>
<path id="Icon_awesome-search" class="st0" d="M111,97.3L89.1,75.4c-1-1-2.3-1.5-3.7-1.5h-3.6c15.5-19.9,12-48.6-7.9-64.1
	s-48.6-12-64.1,7.9s-12,48.6,7.9,64.1c16.5,12.9,39.7,12.9,56.2,0v3.6c0,1.4,0.5,2.7,1.5,3.7L97.3,111c2,2.1,5.4,2.1,7.4,0
	c0,0,0,0,0,0l6.2-6.2C113,102.7,113,99.4,111,97.3L111,97.3z M45.7,73.8c-15.5,0-28.1-12.6-28.1-28.1s12.6-28.1,28.1-28.1
	s28.1,12.6,28.1,28.1l0,0C73.9,61.2,61.3,73.8,45.7,73.8C45.7,73.8,45.7,73.8,45.7,73.8z"/>
</svg>
