{
    "annee": "1MA1",
    "theme": "Ensembles de nombres et calcul numérique",
    "sousTheme": "Série 1",
    "objectif": {
      "reference": "1MA1-1-1",
      "titre": "Appliquer les critères de divisibilité pour 2, 3, 5 et 9",
      "rappelDuCoursImage": "",
      "videos": [],
      "fiches": [
        {
          "materielEleve": [],
          "materielEnseignant": [],
          "debutDeSeance": [
            "Questions Flash"
          ],
          "deroule": [
            "Enseignement" 
          ],
          "devoirs": [],
          "finDeSeance": [],
          "prochaineSeance": []
        }
      ],
      "exercices": [
        {
          "slug": "uuid=d5a6d&id=2N20-2",
          "description": "Appliquer les critères de divisibilité"
        }
      ]
    }
  }