{
    "annee": "CO",
    "theme": "Fonctions et Algèbre",
    "sousTheme": "COFA5 - Systèmes d'équations",
    "objectif": {
      "reference": "COFA5-8",
      "titre": "Mettre un problème en système d'équations",
      "rappelDuCoursHTML": "On commence par lire l'énoncé attentivement. Comme pour la mise en équation d'un problème à une inconnue. On suit la méthode suivante: <br> <b> 1. </b> Lire attentivement l'énoncé et identifier les inconnues. <br> <b> 2. </b> Traduire les informations de l'énoncé en équations. <br> <b> 3. </b> Trouver l'information qui permet d'écrire les deux équations <br> <b> 4. </b> Résoudre le système d'équations obtenu. <br> <b> 5. </b> Vérifier que les solutions trouvées correspondent bien au problème posé.",
      "rappelDuCoursImage": "",
      "videos": [{
        "titre": " Mettre un problème en équations (Système) - Seconde",
        "slug": "https://www.youtube.com/embed/oQ0c4iU-PGM?si=JZKbR--0g4QnS6Xa",
        "auteur": "Yvan Monka",
        "lienAuteur": "https://www.youtube.com/@YMONKA"
      },
      {
        "titre": "Exercice: Mettre un problème en équations (Système) - Seconde",
        "slug": "https://www.youtube.com/embed/44gsDrKGSdk?si=hp0FnysrR_Ayw96J",
        "auteur": "Yvan Monka",
        "lienAuteur": "https://www.youtube.com/@YMONKA"
      }],
      "exercices": [{
            "slug": "uuid=6fbf9",
            "description": "Mise en système d'équations et résolution"
          }] 
    }
  }