<?xml version="1.0" encoding="UTF-8" standalone="no"?>
<!-- Created with Inkscape (http://www.inkscape.org/) -->

<svg
   version="1.1"
   id="svg394"
   width="1146.6667"
   height="1070.6667"
   viewBox="0 0 1146.6667 1070.6667"
   sodipodi:docname="Rattata.svg"
   inkscape:version="1.2.1 (9c6d41e, 2022-07-14)"
   xmlns:inkscape="http://www.inkscape.org/namespaces/inkscape"
   xmlns:sodipodi="http://sodipodi.sourceforge.net/DTD/sodipodi-0.dtd"
   xmlns="http://www.w3.org/2000/svg"
   xmlns:svg="http://www.w3.org/2000/svg">
  <defs
     id="defs398" />
  <sodipodi:namedview
     id="namedview396"
     pagecolor="#ffffff"
     bordercolor="#000000"
     borderopacity="0.25"
     inkscape:showpageshadow="2"
     inkscape:pageopacity="0.0"
     inkscape:pagecheckerboard="0"
     inkscape:deskcolor="#d1d1d1"
     showgrid="false"
     inkscape:zoom="0.56787044"
     inkscape:cx="573.19412"
     inkscape:cy="535.33337"
     inkscape:window-width="1470"
     inkscape:window-height="828"
     inkscape:window-x="0"
     inkscape:window-y="37"
     inkscape:window-maximized="1"
     inkscape:current-layer="g400" />
  <g
     inkscape:groupmode="layer"
     inkscape:label="Image"
     id="g400">
    <path
       style="fill:#000000;stroke-width:1.33333"
       d="m 452.21715,986.33336 c 0.45294,-11.91392 1.05561,-14.80758 4.69921,-22.56274 2.29879,-4.89286 5.71713,-11.15875 7.59632,-13.92422 1.87919,-2.76546 3.20403,-5.2408 2.94409,-5.50073 -0.25994,-0.25993 -6.50278,1.05596 -13.87298,2.92421 -7.3702,1.86824 -14.34163,3.39682 -15.49207,3.39682 -3.21925,0 -2.49751,-4.17138 1.9296,-11.15219 9.00751,-14.20336 23.64547,-26.56992 40.49132,-34.2082 l 8.21183,-3.72342 4.41538,-15.12477 c 2.42847,-8.31861 6.76547,-20.15781 9.63778,-26.30932 2.87232,-6.15152 5.22238,-11.73719 5.22238,-12.41261 0,-1.42382 20.58353,-40.52731 29.91325,-56.82759 3.49158,-6.1003 5.93989,-11.49988 5.44068,-11.99911 -0.49923,-0.49921 -4.00808,-1.62095 -7.79747,-2.49272 l -6.88979,-1.58505 -12,7.50345 c -6.6,4.12691 -18.98713,12.03977 -27.52697,17.58416 -37.40571,24.28519 -55.31282,35.24915 -66.8213,40.9126 -12.0132,5.91184 -12.56616,6.04559 -22.3184,5.3982 -15.99157,-1.06154 -43.46297,-11.82406 -54.16467,-21.22016 -13.01465,-11.42688 -13.99606,-31.66891 -2.54648,-52.52187 3.14888,-5.735 4.62311,-10.31625 4.93419,-15.33333 l 0.44363,-7.15475 -14.52434,-2.91341 C 291.13693,738.46022 198.52511,734.74489 160,740.10049 c -5.5,0.76459 -26.5,1.92548 -46.66666,2.57976 -23.613,0.76608 -40.226763,1.93029 -46.666671,3.27017 -16.850905,3.50599 -19.589222,3.79295 -20.599236,2.15871 -1.526493,-2.46992 6.254697,-17.43132 13.743213,-26.42497 3.808288,-4.57372 10.208828,-10.7958 14.223424,-13.82686 4.014596,-3.03105 7.298675,-5.88892 7.297952,-6.35081 -0.002,-1.27416 -19.333286,-11.35314 -30.998687,-16.16212 -5.871375,-2.42044 -10.333334,-5.05804 -10.333334,-6.10834 0,-5.30094 26.030006,-12.54569 45.127508,-12.56 10.02131,-0.008 13.153721,-0.49834 16.000001,-2.50713 10.05766,-7.09827 45.12417,-20.86928 62.97453,-24.7308 4.71055,-1.01903 13.21463,-2.90201 18.89797,-4.18441 l 10.33333,-2.33166 V 613.0991 c 0,-18.50123 -0.20872,-20.15439 -3.1304,-24.79434 -10.00191,-15.88412 -14.96919,-25.70317 -19.10566,-37.76702 -8.16737,-23.81984 -5.87472,-40.47346 7.14566,-51.9055 4.72743,-4.15073 27.15284,-15.61365 37.66681,-19.25368 2.53375,-0.87721 4.81355,-2.21508 5.0662,-2.97304 0.4988,-1.49641 -18.33754,-19.16332 -41.64261,-39.05727 -8.06667,-6.88597 -18.26667,-15.86954 -22.66667,-19.96352 -4.4,-4.09397 -10.66447,-9.68586 -13.92104,-12.42645 -4.08507,-3.4378 -5.49265,-5.41124 -4.53949,-6.3644 1.6322,-1.6322 19.79018,5.91452 34.91324,14.51043 5.38233,3.0593 10.07009,5.56237 10.41725,5.56237 1.85688,0 33.54238,22.28843 46.16718,32.47521 l 14.63468,11.80854 4.28097,-4.4752 c 2.35455,-2.46138 10.3494,-10.79994 17.76636,-18.53016 l 13.48536,-14.05494 -1.77936,-6.61173 c -4.77144,-17.72961 -6.17904,-56.96646 -2.83228,-78.94996 4.21303,-27.67374 32.98732,-83.00447 47.9866,-92.27454 4.48536,-2.77211 5.39324,-2.88811 10.78611,-1.3782 7.87932,2.20608 29.59648,14.31236 36.82355,20.52739 3.19598,2.74843 12.58706,10.42372 20.86906,17.05619 11.2627,9.01949 15.8457,13.61528 18.1825,18.23322 3.91941,7.74544 6.09265,21.50191 6.09265,38.56611 v 13.21447 l 13,0.86733 c 35.28147,2.35393 70.89764,13.06967 115.46051,34.73827 l 21.05367,10.23732 7.57625,-7.80579 c 10.30462,-10.61681 16.99158,-14.92374 41.05552,-26.44299 11.33706,-5.42697 20.82897,-9.86721 21.09313,-9.86721 0.26417,0 13.70477,-6.30516 29.86801,-14.01145 33.38011,-15.91498 39.14575,-17.37566 52.85461,-13.39039 19.77963,5.75011 36.79013,35.83235 44.14509,78.06851 1.72894,9.92852 2.04342,17.56651 1.4548,35.33333 -0.74859,22.59535 -2.91123,36.44751 -10.09594,64.66667 -1.40032,5.5 -2.43432,10.11864 -2.29776,10.26364 0.13655,0.14499 4.42964,-1.72829 9.5402,-4.16286 23.28963,-11.09475 44.6668,-19.8283 71.29192,-29.126 20.94319,-7.31354 33.51698,-8.10567 48.54731,-3.05845 29.76622,9.99558 55.65646,26.32067 78.95416,49.78457 5.29771,5.33548 9.9185,9.23548 10.26842,8.66666 1.70978,-2.77932 7.55087,-28.15589 9.752,-42.36756 3.43683,-22.18988 3.47171,-69.40393 0.068,-92 -7.89175,-52.3903 -26.5726,-102.22475 -54.02062,-144.10949 -22.69722,-34.63518 -46.67137,-57.89658 -79.71168,-77.34184 -6.74296,-3.96844 -12.4694,-7.21465 -12.72541,-7.2138 -0.25603,8.4e-4 -0.47438,5.85084 -0.48524,13 -0.0175,11.51098 -0.43098,13.78239 -3.61335,19.84892 -7.16139,13.65168 -22.17064,21.59816 -43.16725,22.85442 -22.9154,1.37105 -52.73985,-13.4984 -77.60643,-38.69196 -26.71464,-27.0659 -40.30566,-55.55569 -40.23726,-84.34626 0.0817,-34.395682 24.72626,-55.227911 65.43202,-55.310183 29.77364,-0.06017 56.10953,7.413272 85.87867,24.370173 10.21129,5.816485 38.59328,24.99522 40.66666,27.47993 0.36667,0.43941 5.76667,5.08695 12.00001,10.32788 27.73086,23.31587 62.67014,64.67926 82.0467,97.1322 13.4017,22.44591 15.34966,25.91954 23.95579,42.71814 8.33799,16.27521 10.22628,20.5956 18.77136,42.94853 5.97372,15.62654 14.83562,49.56855 18.36342,70.33334 5.1015,30.02844 6.694,78.0534 3.6917,111.33333 -2.4772,27.45986 -4.3634,36.63313 -15.3869,74.83357 -0.9788,3.3918 -4.59939,12.3186 -8.04586,19.83733 -4.55153,9.92955 -6.04193,14.62711 -5.44641,17.16644 0.45093,1.9228 3.51103,13.396 6.8002,25.496 3.28917,12.1 7.27317,26.8 8.85337,32.66667 5.9417,22.05901 14.7102,47.11724 21.0567,60.17464 5.8828,12.10324 7.7762,14.63027 18.2073,24.30024 8.1724,7.5761 14.6453,12.2309 21.7205,15.61975 5.5433,2.65512 12.0688,5.82 14.5009,7.03309 7.5301,3.75576 21.1165,18.89956 22.984,25.61867 3.0113,10.83407 1.8055,88.29995 -1.659,106.58695 -2.7164,14.338 -4.1744,16.38136 -20.1845,28.28864 -16.4612,12.24279 -29.0002,22.63604 -42.5876,35.29986 -4.9637,4.62633 -9.8706,8.4115 -10.9041,8.4115 -3.4911,0 -4.5646,-25.85241 -1.3979,-33.66666 3.4232,-8.44702 -11.8565,6.64873 -26.9915,26.66666 -6.23756,8.25 -11.84653,15 -12.46436,15 -5.11265,0 -8.67417,-37.92013 -4.53716,-48.30793 0.65778,-1.65161 -2.8962,-0.34208 -12.49763,4.60501 -7.37924,3.80211 -13.84632,6.4834 -14.3713,5.95842 -1.14252,-1.14252 2.30482,-12.63444 7.75433,-25.8495 3.22052,-7.80977 5.65755,-11.19888 13.10414,-18.22361 5.03132,-4.7463 11.88893,-10.236 15.23916,-12.19936 l 6.09132,-3.56975 v -10.41485 -10.41486 l -7,-0.9024 c -18.87658,-2.43342 -40.82781,-9.69729 -51.60003,-17.07494 -9.38747,-6.42926 -24.94696,-23.04415 -30.78844,-32.87682 -2.90302,-4.88649 -5.2782,-9.55759 -5.2782,-10.38023 0,-1.75988 -7.86796,1.31876 -36.46555,14.26853 -29.52023,13.36756 -40.08967,16.8118 -61.75808,20.12494 -9.14831,1.39879 -9.71335,1.69923 -13.21426,7.02598 -6.12344,9.31705 -27.3411,29.38438 -35.22017,33.31069 -3.95937,1.97304 -8.34039,3.58735 -9.73557,3.58735 -1.39518,0 -4.42738,0.84252 -6.73821,1.87225 -30.35242,13.52551 -38.74461,16.78464 -39.99646,15.53279 -0.95351,-0.95351 -0.84503,-3.47618 0.35,-8.1389 0.95248,-3.7164 1.45194,-7.03693 1.10992,-7.37896 -0.34203,-0.34202 -10.11263,3.01694 -21.71243,7.46435 -11.59981,4.44743 -21.84124,7.79816 -22.75872,7.44609 -0.91749,-0.35208 -1.86143,-2.13548 -2.09765,-3.96313 -0.3773,-2.91913 -5.29079,1.49205 -40.4295,36.29642 -41.91583,41.51698 -48.75256,47.45362 -64,55.57402 -30.28517,16.12911 -52.25564,26.40476 -54.56308,25.51932 -3.0538,-1.17185 -2.79766,-15.03568 0.43498,-23.54328 1.39622,-3.67453 2.20743,-6.68097 1.80271,-6.68097 -0.73527,0 -17.31557,12.40731 -33.67461,25.19927 -4.76667,3.72729 -9.78472,6.78225 -11.15123,6.78881 -2.29664,0.0107 -2.44527,-1.02173 -1.96497,-13.65475 z m 76.28368,-10.46593 c 13.29121,-6.67293 27.76585,-14.71537 32.16585,-17.87211 4.4,-3.15673 26.05716,-23.72626 48.12704,-45.71008 22.06987,-21.98381 41.38042,-40.64137 42.91234,-41.46123 4.18784,-2.24126 7.89705,-1.80517 10.75705,1.26468 l 2.56699,2.75532 16.79692,-6.08865 c 9.23831,-3.34877 18.56369,-6.08867 20.72305,-6.08867 4.98023,0 8.11662,3.10659 8.11662,8.03947 v 3.849 l 8.52566,-3.8252 c 4.68911,-2.10387 14.31822,-5.81353 21.39799,-8.24372 15.92982,-5.468 27.39051,-13.71779 38.90312,-28.00376 4.51394,-5.60132 8.78987,-11.22547 9.50208,-12.49812 0.94895,-1.69568 6.95595,-3.50027 22.48304,-6.75423 21.91098,-4.5918 28.44838,-6.64752 43.18811,-13.58072 27.16722,-12.77877 41.21135,-18.84021 45.52627,-19.64913 5.74895,-1.07775 9.91373,0.77657 11.22625,4.99833 1.64883,5.30351 11.89728,20.12724 18.84362,27.25607 3.70928,3.80673 10.982,9.66279 16.16161,13.01345 10.4624,6.76811 30.7093,14.03271 39.3625,14.1233 8.24352,0.0863 17.04976,2.06581 18.35496,4.12592 1.6259,2.56621 1.474,27.46337 -0.1865,30.56598 -0.7578,1.41606 -3.711,3.76491 -6.56253,5.21967 -9.4596,4.82593 -21.44163,17.22453 -25.59802,26.48799 -2.08716,4.65169 -3.79482,8.96691 -3.79482,9.58936 0,0.62245 2.55,-0.32625 5.66666,-2.10823 6.44877,-3.68714 11.90863,-4.17298 14.76753,-1.3141 1.61273,1.61274 1.8301,5.37445 1.23273,21.33333 -0.39889,10.65644 -0.40923,19.37535 -0.0229,19.37535 0.38626,0 3.20318,-3.31239 6.25981,-7.36087 13.37784,-17.71881 26.23974,-29.97247 31.46044,-29.97247 6.3357,0 7.3875,2.90531 6.4164,17.72347 l -0.8868,13.53213 11.2287,-9.96113 c 6.1757,-5.47863 19.4456,-16.44705 29.4885,-24.37429 10.0429,-7.92725 18.5629,-15.42725 18.9332,-16.66667 1.6513,-5.52655 3.5183,-21.70592 5.5681,-48.25351 2.4658,-31.93456 1.8738,-54.18626 -1.7103,-64.29043 -3.1617,-8.91332 -13.2216,-18.2466 -27.0687,-25.11361 -41.9272,-20.79235 -51.1993,-35.73899 -73.9841,-119.26263 -10.82899,-39.69644 -12.68257,-47.15786 -12.68257,-51.05242 0,-2.28347 2.12536,-8.98569 4.72302,-14.89384 7.11031,-16.17179 16.17115,-44.54933 18.53635,-58.05375 10.549,-60.23007 10.5721,-88.14444 0.1287,-155.05548 C 997.21947,305.00292 965.16934,236.47361 919.87083,177.33334 905.53118,158.61196 865.7429,119.01539 847.83963,105.6492 820.9744,85.592216 789.36157,69.577469 765.33339,63.852361 c -18.25088,-4.348572 -42.48485,-4.40048 -54.87811,-0.117547 -17.67218,6.107246 -29.85558,18.047165 -33.7768,33.101804 -2.65131,10.179022 -2.52646,16.272032 0.60064,29.314882 6.00898,25.06287 19.5939,45.67893 45.67261,69.31135 12.24724,11.0984 21.84617,17.57802 33.71499,22.75882 18.02877,7.86967 27.829,8.65011 44.36033,3.53263 5.85507,-1.81251 9.40496,-4.11188 15.1967,-9.84332 9.16394,-9.06855 11.11334,-14.76709 9.80993,-28.67653 -0.73716,-7.8665 -0.51164,-9.89928 1.29909,-11.71002 4.71672,-4.71672 13.1759,-1.54377 35.33395,13.25344 34.76554,23.21651 61.72359,54.37185 84.91632,98.13751 6.09603,11.50346 11.08368,21.61631 11.08368,22.47303 0,0.85672 1.42471,4.3942 3.16603,7.86107 6.89624,13.73012 17.4893,49.09627 23.78747,79.4172 2.81623,13.55803 3.04605,17.9926 3.04048,58.66667 -0.007,47.84761 -0.64029,53.348 -9.40685,81.64512 -3.68376,11.89063 -5.85146,15.03275 -10.34903,15.00114 -3.6988,-0.026 -4.50603,-0.65344 -10.60082,-8.23986 -10.51482,-13.08817 -43.70054,-36.73241 -63.63728,-45.34044 -25.76448,-11.12424 -29.58665,-11.58477 -51.33333,-6.18523 -10.35402,2.57084 -58.62815,20.95474 -64,24.37267 -6.74734,4.29311 -27.52304,11.65473 -30.66563,10.866 -6.2446,-1.56729 -6.10772,-5.49792 1.16495,-33.45273 8.54408,-32.84195 9.61406,-65.58706 3.02802,-92.66667 -6.58838,-27.0892 -15.39639,-44.45652 -28.31256,-55.82579 -10.60367,-9.33373 -20.73572,-10.14514 -35.21479,-2.82012 -10.66662,5.39631 -32.5473,15.77568 -54.66666,25.93183 -37.60331,17.26565 -45.23886,21.77556 -56.75834,33.52412 -6.70849,6.84189 -9.17173,8.52329 -12.48656,8.52329 -2.38812,0 -10.90533,-3.39665 -20.19803,-8.05493 -45.50533,-22.81114 -94.69935,-37.27841 -126.7602,-37.27841 -9.65316,0 -9.93631,-0.67008 -10.82043,-25.60678 -1.08464,-30.59255 -0.35184,-29.22439 -26.82732,-50.08676 -31.82072,-25.07437 -37.09281,-28.49029 -47.62359,-30.85639 -5.60936,-1.26034 -5.8782,-1.16299 -10.65445,3.85789 -11.24996,11.82618 -32.17283,52.85206 -38.05983,74.62835 -5.09319,18.83989 -5.79835,45.57068 -1.77796,67.39703 1.62096,8.8 3.22924,19.10049 3.57396,22.88997 l 0.62678,6.88999 -18.45035,19.49075 c -10.14771,10.7199 -19.80036,19.83446 -21.45036,20.25456 -5.19984,1.32392 -8.70008,-0.55342 -19.78806,-10.61319 -10.75437,-9.75709 -35.6848,-27.78863 -44.54528,-32.21845 -4.50505,-2.25232 -4.45886,-2.1549 1.33334,2.81286 17.18828,14.74179 44.11401,41.15023 44.81861,43.95758 1.74259,6.943 -0.22059,9.45761 -9.81656,12.57393 -21.69175,7.04446 -37.6326,17.43699 -43.0578,28.07127 -6.29644,12.34205 -0.4574,34.37617 16.75247,63.21688 l 7.30328,12.23902 v 22.78885 c 0,26.28459 0.12506,25.98143 -11.66756,28.29376 -4.21618,0.82673 -9.16578,2.05128 -10.99911,2.72123 -1.83333,0.66993 -9.33334,2.68265 -16.66667,4.4727 -17.42976,4.25456 -39.20745,12.75622 -50.76246,19.81686 -9.15672,5.59516 -9.37752,5.65198 -25.237541,6.49506 -8.8,0.46779 -18.850394,1.59592 -22.334207,2.50696 l -6.334208,1.65643 13.399769,6.57372 c 15.46837,7.58855 18.60198,10.24544 18.60198,15.77206 0,3.30612 -2.515791,6.51324 -14.570148,18.57397 -8.01358,8.01781 -15.245033,15.83889 -16.069895,17.38016 -1.348677,2.52003 -1.190513,2.73775 1.570147,2.16147 8.66882,-1.80962 32.863238,-3.47584 59.069893,-4.06806 16.13334,-0.36457 33.53334,-1.2641 38.66667,-1.99896 16.61562,-2.37856 66.5841,-3.14272 98,-1.49868 35.29399,1.84698 79.55021,6.3402 92.66667,9.4082 7.16552,1.67606 10.50775,5.91884 9.47276,12.02516 -2.37096,13.98827 -3.35644,17.31778 -7.10969,24.02062 -6.981,12.4672 -8.21613,27.64245 -3.03745,37.31892 2.94449,5.50184 17.0356,13.31841 38.00772,21.08352 12.29544,4.55249 23.04285,4.67172 31.33333,0.34761 10.67212,-5.56632 58.29742,-35.35464 95.52783,-59.75005 13.82595,-9.05952 16.61384,-9.70455 29.7593,-6.88535 13.67428,2.9326 13.83112,6.91673 1.1468,29.13164 -23.67714,41.46736 -38.73849,75.16204 -46.33221,103.65267 -1.32266,4.96249 -2.16713,5.82081 -7.79257,7.92043 -3.47003,1.29513 -10.50915,5.18273 -15.64248,8.63911 -9.55772,6.43538 -23.09568,19.2236 -21.76225,20.55704 0.40901,0.409 3.37284,0.13749 6.58628,-0.60335 8.32484,-1.91925 12.67548,-1.7222 15.08073,0.68305 3.39149,3.3915 2.44201,8.38254 -3.20276,16.83567 -5.64221,8.44927 -7.62744,13.82024 -8.95008,24.21413 l -0.82439,6.47838 15.0188,-11.34879 c 18.58735,-14.04531 22.57995,-16.26693 27.16574,-15.11597 4.56432,1.14557 5.83494,6.15026 3.57876,14.09594 -2.43156,8.56336 -3.1575,13.41207 -2.00802,13.41207 0.54202,0 11.86011,-5.45967 25.15134,-12.1326 z M 695.42859,819.23812 c -1.15238,-1.15237 -2.09524,-3.47911 -2.09524,-5.17049 0,-3.77768 3.74831,-13.04483 5.81652,-14.38053 5.09158,-3.28821 20.3696,1.26735 21.67351,6.46257 1.77324,7.06514 -0.22317,9.55869 -9.97925,12.46418 -10.97931,3.26978 -12.70034,3.33947 -15.41554,0.62427 z m 11.981,-7.39637 c 3.25807,-0.8204 5.92376,-1.89987 5.92376,-2.39883 0,-0.96747 -9.32901,-4.66747 -9.82985,-3.89863 -1.23868,1.90154 -3.30371,7.78907 -2.73199,7.78907 0.39288,0 3.38002,-0.67123 6.63808,-1.49161 z"
       id="path404" />
  </g>
</svg>
