
      {
        "nom": "1MA1",
        "reference": "1MA1-S5",
        "titre": "Semaine 5",
        "periode": 1,
        "objectifs": [
          {
            "reference": "1MA1-3-3"
          },
          {
            "reference": "COFA-3"
          }
        ],
        "prerequis": [{
          "reference": "COFA-3"
        },
        {
          "reference": "COFA-5"
        }
        ],
        "documents": []
      }
      