{
"annee": "CO",
"theme": "Fonctions et Algèbre",
"sousTheme": "COFA2 - Équations du premier degré",
"objectif": {
  "reference": "COFA2-3",
"titre": "Mettre un problème en équation pour le résoudre",
"rappelDuCoursImage": "",
    "videos": [
    ],
    "fiches": [
    {
    "materielEleve": [],
    "materielEnseignant": [],
    "debutDeSeance": [
    "Questions Flash"
    ],
    "deroule": [
    "Enseignement" 
    ],
    "devoirs": [],
    "finDeSeance": [],
    "prochaineSeance": []
    }
    ],
    "exercices": [
      {
        "slug": "uuid=5ca1e&id=4L13-2&n=2&d=10&s=1-2-3-4-5-6-7-8-9-10&s2=false&8mn7&cd=1",
        "description": "Mettre un problème en équation et le résoudre"
      }
    ]
    }
    }