
      {
        "nom": "1MA1",
        "reference": "1MA1-S4",
        "titre": "Semaine 4",
        "periode": 1,
        "objectifs": [
          {
            "reference": "1MA1-3-1"
          },
          {
            "reference": "1MA1-3-2"
          }
        ],
        "prerequis": [{
          "reference": "COFA-1"
        },
        {
          "reference": "COFA-2"
        }
        ],
        "documents": []
      }
      