<?xml version="1.0" encoding="UTF-8" standalone="no"?>
<!-- Created with Inkscape (http://www.inkscape.org/) -->

<svg
   width="44.894535mm"
   height="95.081444mm"
   viewBox="0 0 44.894535 95.081444"
   version="1.1"
   id="svg5"
   xml:space="preserve"
   inkscape:version="1.2.1 (9c6d41e, 2022-07-14)"
   sodipodi:docname="fleche-tableau-proportionnalite.svg"
   xmlns:inkscape="http://www.inkscape.org/namespaces/inkscape"
   xmlns:sodipodi="http://sodipodi.sourceforge.net/DTD/sodipodi-0.dtd"
   xmlns="http://www.w3.org/2000/svg"
   xmlns:svg="http://www.w3.org/2000/svg"><sodipodi:namedview
     id="namedview7"
     pagecolor="#ffffff"
     bordercolor="#000000"
     borderopacity="0.25"
     inkscape:showpageshadow="2"
     inkscape:pageopacity="0.0"
     inkscape:pagecheckerboard="0"
     inkscape:deskcolor="#d1d1d1"
     inkscape:document-units="mm"
     showgrid="false"
     inkscape:zoom="0.2102413"
     inkscape:cx="-47.564394"
     inkscape:cy="361.48939"
     inkscape:window-width="1463"
     inkscape:window-height="456"
     inkscape:window-x="0"
     inkscape:window-y="37"
     inkscape:window-maximized="0"
     inkscape:current-layer="layer1" /><defs
     id="defs2" /><g
     inkscape:label="Calque 1"
     inkscape:groupmode="layer"
     id="layer1"
     transform="translate(-86.945833,-75.657804)"><path
       style="fill:#ff0000;fill-opacity:1;stroke-width:0.88636"
       d="m 100.7865,167.28123 c -7.256357,-2.09949 -13.369533,-3.99343 -13.584849,-4.20877 -0.312156,-0.31222 4.433482,-19.68533 6.485809,-26.47734 0.758748,-2.51098 1.816452,-1.82684 4.582368,2.96384 l 2.606692,4.51496 3.18631,-2.79761 c 1.75246,-1.5387 4.40156,-5.22959 5.8869,-8.20197 2.32941,-4.66163 2.69131,-6.329 2.63315,-12.13208 -0.0372,-3.70028 -0.53567,-7.99775 -1.10795,-9.54997 C 108.36647,102.9612 99.636304,95.750294 91.156046,94.609424 l -4.210213,-0.56642 v -9.192599 -9.192601 h 4.016581 c 4.706218,0 12.375966,2.423952 18.488196,5.843023 11.06139,6.187537 19.98298,19.971133 21.95574,33.920953 2.06744,14.61928 -3.31602,29.14279 -14.76601,39.83584 l -6.39584,5.97296 2.57396,4.55597 c 1.41565,2.50579 2.25611,4.72605 1.86767,4.93395 -0.38847,0.20804 -6.6433,-1.33977 -13.89963,-3.43927 z"
       id="path349" /></g></svg>
