{
    "annee": "CO",
    "theme": "Fonctions et Algèbre",
    "sousTheme": "COFA5 - Systèmes d'équations",
    "objectif": {
      "reference": "COFA5-3",
      "titre": "Déterminer la position relative de deux droites",
      "rappelDuCoursHTML": "Un système d'équations du premier degré à deux inconnues peut être écrit sous la forme \\[\\begin{cases}\\begin{aligned} y&=ax+c\\\\y&=bx+d\\end{aligned}\\end{cases}\\] avec $a,b,c,d$ des nombres réels (on peut toujours isoler la variable $y$ dans les équations. Chaque équation représente une droite et la solution du système d'équations correspond au point d'intersection des deux droites. Trois cas se présentent:<br>- Les droites sont parallèles, le système n'a pas de solution.<br>- Les droites sont confondues, le système a une infinité de solutions.<br>- Les droites se croisent en un point, le système a une solution unique.",
      "rappelDuCoursImage": "",
      "videos": [{
        "titre": "Etudier la position relative de deux droites - Seconde",
        "slug": "https://www.youtube.com/embed/gTUPGw7Bulc?si=95j3BoJpqRgQavbe",
        "auteur": "Yvan Monka",
        "lienAuteur": "https://www.youtube.com/@YMONKA"
      }],
      "exercices": [{
            "slug": "uuid=2eee3",
            "description": "Déterminer la position relative de deux droites et déduire le nombre de solution d'un système d'équations"
          }]
    }
  }