{
    "annee": "CO",
    "theme": "Grandeurs et Mesures",
    "sousTheme": "COGM3 - Théorème de Thalès",
    "objectif": {
    "reference": "COGM3-5",
    "titre": "Utiliser le théorème de Thalès dans des situations plus avancées",
    "rappelDuCoursImage": "",
    "videos": [
    ],
    "fiches": [
    {
    "materielEleve": [],
    "materielEnseignant": [],
    "debutDeSeance": [
    "Questions Flash"
    ],
    "deroule": [
    "Enseignement" 
    ],
    "devoirs": [],
    "finDeSeance": [],
    "prochaineSeance": []
    }
    ],
    "exercices": [
      {
        "slug": "uuid=eea67&id=11GM3-8&n=1&d=10&s=2&cd=1",
        "description": "Utilisation du théorème de Thalès dans une situation avancée"
      }
    ]
    }
    }