{"nom": "1MA1",
    "reference": "1MA1-C5",
    "titre": "Chapitre 5 : Degrés 0 et 1",
    "periode":1,
    "infos": "Les connaissances mathématiques que vous allez acquérir ces quatre prochaines années sont pyramidales. Ce premier chapitre est la base de la pyramide, les fondations du savoir que vous allez construire au fil des cours au collège.<br><br> Nous reprenons toutes les techniques de calculs avec des nombres que vous avez déjà rencontrées dans votre parcours scolaire. Une maîtrise de la priorité des opérations, des quatre opérations avec les entiers ($\\mathbb{Z}$) ainsi qu'avec les fractions ($\\mathbb{Q}$) est requise. Par ailleurs, nous reverrons également les règles de calculs avec les puissances ($a^n, a\\in \\mathbb{Q}, n\\in \\mathbb{Z}$) ainsi que celles avec les racines carrées et cubiques ($\\sqrt{a}, a\\in \\mathbb{Q}^+$ et $\\sqrt[3]{a}, a\\in \\mathbb{Q}$). La matière couverte est identique à celle de 11LS, mais le niveau d'exigence et la complexité des calculs sont plus élevés. Enfin, nous attendons également la maîtrise de la calculatrice comme outil de travail.<br><br> L'étude des règles de calculs avec les différents ensembles de nombres ($\\mathbb{N}, \\mathbb{Z}, \\mathbb{Q}, \\mathbb{R}$) et de leurs différentes propriétés s'appelle l'arithmétique.",
    "sequencesListe": [{"referenceDonnee": "11LS33"},{"referenceDonnee": "11LS34"}],
    "documents": []
  }